1,2,3,4,5,6,7,8-Octahydronaphthalene
- Formula: C10H18
- Molecular weight: 138.2499
- IUPAC Standard InChIKey: ZKZCHOVDCNLSKG-UHFFFAOYSA-N
- CAS Registry Number: 493-03-8
- Chemical structure:
View 3d structure (requires JavaScript / HTML 5) - Species with the same structure:

Condensed phase thermochemistry data

Data compiled by: Hussein Y. Afeefy, Joel F. Liebman, and Stephen E. Stein
Quantity | Value | Units | Method | Reference | Comment |
---|---|---|---|---|---|
ΔcH°solid | -6076.8 | kJ/mol | Ccb | Dallwick and Briner, 1953 | Corresponding ΔfHºsolid = -430.5 kJ/mol (simple calculation by NIST; no Washburn corrections) |

References

Dallwick and Briner, 1953
Dallwick, E.; Briner, E.,
145. Recherches sur le spectre d'absorption infrarouge des ozonides. VI. Spectres de la {delta}-octaline et de ses produits d'ozonation; chaleur d'ozonation de la {delta}-octaline,
Helv. Chim. Acta, 1953, 36, 1166-1173. [all data]