Naphthalene, decahydro-, trans-
- Formula: C10H18
- Molecular weight: 138.2499
- IUPAC Standard InChIKey: NNBZCPXTIHJBJL-MGCOHNPYSA-N
- CAS Registry Number: 493-02-7
- Chemical structure:
View 3d structure (requires JavaScript / HTML 5) - Stereoisomers:
- Other names: trans-Bicyclo[4.4.0]Decane; trans-Decahydronaphthalene; trans-Decalin; trans-Perhydronaphthalene; Decahydronaphthalene, trans-; Decahydronaphthalene, (E)-; (E)-Decahydronaphthalene; t-Decalin; Bicyclo[4.4.0]decane, isomer # 1; trans-Decaline

Kovats' RI, non-polar column, isothermal

Column type | Active phase | Temperature (C) | I | Reference | Comment |
---|---|---|---|---|---|
Capillary | HP-1 | 100. | 1059. | Zhang, Li, et al., 1992 | N2; Column length: 25. m; Column diameter: 0.20 mm |
Capillary | HP-1 | 100. | 1059. | Zhang, Li, et al., 1992 | N2; Column length: 25. m; Column diameter: 0.20 mm |
Packed | OV-101 | 120. | 1068. | Litvinenko, Isakova, et al., 1988 | He, Chromaton W AW; Column length: 2.4 m |
Packed | SE-30 | 150. | 1085. | Tiess, 1984 | Ar, Gas Chrom Q (80-100 mesh); Column length: 3. m |
Capillary | OV-101 | 100. | 1057. | Boneva, Papazova, et al., 1983 | N2; Column length: 85. m; Column diameter: 0.28 mm |
Capillary | OV-101 | 100. | 1057. | Boneva, Papazova, et al., 1983 | N2; Column length: 85. m; Column diameter: 0.28 mm |
Capillary | OV-101 | 110. | 1062. | Boneva, Papazova, et al., 1983 | N2; Column length: 85. m; Column diameter: 0.28 mm |
Capillary | OV-101 | 90. | 1051. | Boneva, Papazova, et al., 1983 | N2; Column length: 85. m; Column diameter: 0.28 mm |
Capillary | SE-30 | 70. | 1041.7 | Tóth, 1983 | N2; Column length: 15. m; Column diameter: 0.25 mm |
Capillary | SE-30 | 130. | 1078. | Bredael, 1982 | Column length: 100. m; Column diameter: 0.5 mm |
Capillary | SE-30 | 150. | 1090. | Bredael, 1982 | Column length: 100. m; Column diameter: 0.5 mm |
Capillary | SE-30 | 80. | 1049. | Bredael, 1982 | Column length: 100. m; Column diameter: 0.5 mm |
Capillary | Squalane | 86. | 1064.7 | Macák, Nabivach, et al., 1982 | N2; Column length: 50. m; Column diameter: 0.25 mm |
Capillary | Squalane | 96. | 1069.3 | Macák, Nabivach, et al., 1982 | N2; Column length: 50. m; Column diameter: 0.25 mm |
Capillary | OV-101 | 140. | 1082.5 | Gerasimenko, Kirilenko, et al., 1981 | N2; Column length: 50. m; Column diameter: 0.3 mm |
Capillary | Squalane | 86. | 1064.7 | Nabivach, Bur'yan, et al., 1978 | Column length: 50. m; Column diameter: 0.25 mm |
Capillary | Squalane | 96. | 1069.3 | Nabivach, Bur'yan, et al., 1978 | Column length: 50. m; Column diameter: 0.25 mm |
Capillary | Squalane | 90. | 1064. | Engewald, Epsch, et al., 1976 | N2; Column length: 100. m; Column diameter: 0.23 mm |
Packed | SE-30 | 150. | 1087. | Shlyakhov, Anvaer, et al., 1975 | |
Capillary | Squalane | 100. | 1070. | Mitra, Mohan, et al., 1974 | H2; Column length: 50. m; Column diameter: 0.2 mm |
Packed | OV-1 | 130. | 1082. | Takeda and Yamamoto, 1972 | N2, Gas Chrom Q (100-120 mesh); Column length: 1. m |
Capillary | Squalane | 120. | 1081. | Schomburg, 1966 | |
Packed | Methyl Silicone | 130. | 1061. | Antheaume and Guiochon, 1965 |

Kovats' RI, non-polar column, temperature ramp

Column type | Active phase | I | Reference | Comment |
---|---|---|---|---|
Capillary | OV-101 | 1043. | Hayes and Pitzer, 1982 | 110. m/0.25 mm/0.20 μm, He, 1. K/min; Tstart: 35. C; Tend: 200. C |
Capillary | Apiezon L | 1097. | Louis, 1971 | N2, 1. K/min; Column length: 50. m; Column diameter: 0.25 mm; Tstart: 60. C |

Kovats' RI, non-polar column, custom temperature program

Column type | Active phase | I | Reference | Comment |
---|---|---|---|---|
Capillary | Petrocol DH-100 | 1052.85 | Haagen-Smit Laboratory, 1997 | He; Column length: 100. m; Column diameter: 0.2 mm; Program: 5C(10min) => 5C/min => 50C(48min) => 1.5C/min => 195C(91min) |

Kovats' RI, polar column, isothermal

Column type | Active phase | Temperature (C) | I | Reference | Comment |
---|---|---|---|---|---|
Capillary | PEG-20M | 70. | 1160.9 | Tóth, 1983 | N2; Column length: 30. m; Column diameter: 0.3 mm |

Van Den Dool and Kratz RI, non-polar column, temperature ramp

Column type | Active phase | I | Reference | Comment |
---|---|---|---|---|
Capillary | HP-5MS | 1055. | Kallio, Jussila, et al., 2006 | 20. m/0.25 mm/0.25 μm, 60. C @ 4. min, 5. K/min, 240. C @ 15. min |
Capillary | DB-5 | 1051.8 | Song, Lai, et al., 2003 | 30. m/0.25 mm/0.25 μm, He, 4. K/min; Tstart: 40. C; Tend: 310. C |
Capillary | DB-5 | 1049.8 | Song, Lai, et al., 2003 | 30. m/0.25 mm/0.25 μm, He, 40. C @ 5. min, 4. K/min; Tend: 310. C |
Capillary | DB-5 | 1045.7 | Song, Lai, et al., 2003 | 30. m/0.25 mm/0.25 μm, He, 2. K/min; Tstart: 40. C; Tend: 310. C |
Capillary | DB-5 | 1051.8 | Song, Lai, et al., 2003 | 30. m/0.25 mm/0.25 μm, He, 4. K/min; Tstart: 40. C; Tend: 310. C |
Capillary | DB-5 | 1055.9 | Song, Lai, et al., 2003 | 30. m/0.25 mm/0.25 μm, He, 6. K/min; Tstart: 40. C; Tend: 310. C |
Capillary | DB-1 | 1038.7 | Sun and Stremple, 2003 | 30. m/0.25 mm/0.25 μm, He, 3. K/min; Tstart: 40. C; Tend: 325. C |
Capillary | DB-5 | 1045.7 | Lai and Song, 1995 | 30. m/0.25 mm/0.25 μm, He, 2. K/min; Tstart: 40. C; Tend: 310. C |
Capillary | DB-5 | 1051.8 | Lai and Song, 1995 | 30. m/0.25 mm/0.25 μm, He, 4. K/min; Tstart: 40. C; Tend: 310. C |
Capillary | DB-5 | 1055.9 | Lai and Song, 1995 | 30. m/0.25 mm/0.25 μm, He, 6. K/min; Tstart: 40. C; Tend: 310. C |
Capillary | DB-5 | 1051.8 | Lai and Song, 1995 | 30. m/0.25 mm/0.25 μm, He, 4. K/min; Tstart: 40. C; Tend: 310. C |
Capillary | DB-5 | 1049.8 | Lai and Song, 1995 | 30. m/0.25 mm/0.25 μm, He, 40. C @ 5. min, 4. K/min; Tend: 310. C |
Capillary | Petrocol DH | 1048. | White, Hackett, et al., 1992 | 100. m/0.25 mm/0.5 μm, He, 1. K/min; Tstart: 30. C; Tend: 220. C |
Capillary | Ultra-1 | 1047.88 | Steward and Pitzer, 1988 | 50. m/0.22 mm/0.33 μm, He, 2. K/min; Tstart: 0. C; Tend: 240. C |
Capillary | Ultra-1 | 1037.52 | Haynes and Pitzer, 1985 | 50. m/0.22 mm/0.33 μm, He, 1. K/min; Tstart: -30. C; Tend: 240. C |
Capillary | Ultra-1 | 1044.69 | Haynes and Pitzer, 1985 | 50. m/0.22 mm/0.33 μm, He, 2. K/min; Tstart: -30. C; Tend: 240. C |
Capillary | Ultra-1 | 1049.50 | Haynes and Pitzer, 1985 | 50. m/0.22 mm/0.33 μm, He, 3. K/min; Tstart: -30. C; Tend: 240. C |
Capillary | Ultra-2 | 1048.56 | Haynes and Pitzer, 1985 | 50. m/0.22 mm/0.33 μm, He, 1. K/min; Tstart: -30. C; Tend: 240. C |
Capillary | Ultra-2 | 1056.17 | Haynes and Pitzer, 1985 | 50. m/0.22 mm/0.33 μm, He, 2. K/min; Tstart: -30. C; Tend: 240. C |
Capillary | Ultra-2 | 1061.35 | Haynes and Pitzer, 1985 | 50. m/0.22 mm/0.33 μm, He, 3. K/min; Tstart: -30. C; Tend: 240. C |
Capillary | OV-101 | 1043. | Hayes and Pitzer, 1981 | 108. m/0.25 mm/0.2 μm, 1. K/min; Tstart: 35. C; Tend: 200. C |

Van Den Dool and Kratz RI, non-polar column, custom temperature program

Column type | Active phase | I | Reference | Comment |
---|---|---|---|---|
Capillary | 5 % Phenyl methyl siloxane | 1049. | Yasuhara, Shiraishi, et al., 1997 | 25. m/0.31 mm/0.52 μm, He; Program: 50C(2min) => (20C/min) => 120C => (7C/min) => 310C(10min) |

Van Den Dool and Kratz RI, polar column, custom temperature program

Column type | Active phase | I | Reference | Comment |
---|---|---|---|---|
Capillary | Carbowax 20M | 1170. | Whitfield, Shea, et al., 1981 | Column length: 150. m; Column diameter: 0.75 mm; Program: not specified |

Normal alkane RI, non-polar column, isothermal

Column type | Active phase | Temperature (C) | I | Reference | Comment |
---|---|---|---|---|---|
Capillary | Polidimethyl siloxane | 130. | 1075. | Nabivach and Gerasimenko, 1996 | |
Capillary | Polidimethyl siloxane | 130. | 1076. | Nabivach and Gerasimenko, 1996 | |
Capillary | Squalane | 120. | 1080. | Rang, Kurashova, et al., 1982 | He; Column length: 50. m; Column diameter: 0.25 mm |
Capillary | Squalane | 110. | 1074. | Papazova and Pankova, 1975 | N2; Column length: 100. m; Column diameter: 0.25 mm |
Capillary | Squalane | 130. | 1084. | Papazova and Pankova, 1975 | N2; Column length: 100. m; Column diameter: 0.25 mm |
Capillary | SE-30 | 150. | 1061. | Vanek, Podrouzková, et al., 1970 | N2; Column length: 50. m; Column diameter: 0.25 mm |
Capillary | SE-30 | 175. | 1075. | Vanek, Podrouzková, et al., 1970 | N2; Column length: 50. m; Column diameter: 0.25 mm |
Packed | Polydimethyl siloxane | 147. | 1078. | Ferrand, 1962 |

Normal alkane RI, non-polar column, temperature ramp

Column type | Active phase | I | Reference | Comment |
---|---|---|---|---|
Capillary | Optima-5 | 1057. | Al-Qudah, Muhaidat, et al., 2012 | 30. m/0.25 mm/0.25 μm, Helium, 60. C @ 1. min, 3. K/min; Tend: 246. C |
Capillary | HP-5 MS | 1046. | Kotowska, Zalikowski, et al., 2012 | 30. m/0.25 mm/0.25 μm, Helium, 35. C @ 5. min, 3. K/min, 300. C @ 15. min |
Capillary | Petrocol DH | 1051. | Supelco, 2012 | 100. m/0.25 mm/0.50 μm, Helium, 20. C @ 15. min, 15. K/min, 220. C @ 30. min |
Capillary | DB-5 | 1053. | Pontes, de Olivera, et al., 2007 | 30. m/0.25 mm/0.25 μm, Hydrogen, 4. K/min; Tstart: 50. C; Tend: 250. C |
Capillary | OV-1 | 1066. | Orav, Kailas, et al., 1999 | 2. K/min; Tstart: 50. C; Tend: 160. C |
Capillary | OV-1 | 1075. | Orav, Kailas, et al., 1999 | 2. K/min; Tstart: 50. C; Tend: 160. C |
Capillary | Ultra-1 | 1058. | Elizalde-González, Hutfliess, et al., 1996 | 50. m/0.2 mm/0.33 μm, H2, 3. K/min, 300. C @ 35. min; Tstart: 60. C |

Normal alkane RI, non-polar column, custom temperature program

Column type | Active phase | I | Reference | Comment |
---|---|---|---|---|
Capillary | HP-5 MS | 1057. | Kotowska, Zalikowski, et al., 2012 | 30. m/0.25 mm/0.25 μm, Helium; Program: not specified |
Capillary | DB-5 | 1057. | Pontes, de Olivera, et al., 2007 | 30. m/0.25 mm/0.25 μm, Hydrogen; Program: not specified |
Capillary | Polymethylsiloxane, (PMS-20000) | 1042. | Cornwell and Cordano, 2003 | Program: not specified |
Capillary | OV-1, SE-30, Methyl silicone, SP-2100, OV-101, DB-1, etc. | 1049. | Waggott and Davies, 1984 | Hydrogen; Column length: 50. m; Column diameter: 0.32 mm; Program: not specified |

Normal alkane RI, polar column, isothermal

Column type | Active phase | Temperature (C) | I | Reference | Comment |
---|---|---|---|---|---|
Capillary | PEG-20M | 120. | 1209. | Rang, Kurashova, et al., 1982 | He; Column length: 100. m; Column diameter: 0.25 mm |
Capillary | Carbowax 20M | 125. | 1195. | Vanek, Podrouzková, et al., 1970 | N2; Column length: 50. m; Column diameter: 0.25 mm |
Capillary | Carbowax 20M | 150. | 1218. | Vanek, Podrouzková, et al., 1970 | N2; Column length: 50. m; Column diameter: 0.25 mm |

Normal alkane RI, polar column, custom temperature program

Column type | Active phase | I | Reference | Comment |
---|---|---|---|---|
Capillary | Carbowax 20M | 1161. | Cornwell and Cordano, 2003 | Program: not specified |
Capillary | DB-Wax | 1227. | Peng, 1996 | 30. m/0.53 mm/1.0 μm; Program: 40 0C (4 min) 4 0C/min -> 200 0C (20 min) |
Capillary | DB-Wax | 1156. | Peng, Yang, et al., 1991 | Program: not specified |
Capillary | DB-Wax | 1163. | Peng, Yang, et al., 1991 | Program: not specified |

Gas phase thermochemistry data

Data compiled as indicated in comments:
ALS - Hussein Y. Afeefy, Joel F. Liebman, and Stephen E. Stein
DRB - Donald R. Burgess, Jr.
GT - Glushko Thermocenter, Russian Academy of Sciences, Moscow
Quantity | Value | Units | Method | Reference | Comment |
---|---|---|---|---|---|
ΔfH°gas | -182.2 ± 2.3 | kJ/mol | Ccb | Speros and Rossini, 1960 | ALS |
ΔfH°gas | -180.2 | kJ/mol | N/A | Davies and Gilbert, 1941 | Value computed using ΔfHliquid° value of -228.7±1.3 kj/mol from Davies and Gilbert, 1941 and ΔvapH° value of 48.5 kj/mol from Speros and Rossini, 1960.; DRB |
Constant pressure heat capacity of gas
Cp,gas (J/mol*K) | Temperature (K) | Reference | Comment |
---|---|---|---|
39.17 | 50. | Dorofeeva O.V., 1988 | Recommended values agree with results of statistical calculations [ Miyazawa T., 1958, Chang S., 1970] within their uncertainties. These functions are also reproduced in the reference book [ Frenkel M., 1994].; GT |
59.59 | 100. | ||
83.80 | 150. | ||
109.18 | 200. | ||
152.32 | 273.15 | ||
168.6 ± 1.0 | 298.15 | ||
169.78 | 300. | ||
236.37 | 400. | ||
297.34 | 500. | ||
349.20 | 600. | ||
392.71 | 700. | ||
429.33 | 800. | ||
460.36 | 900. | ||
486.74 | 1000. | ||
509.26 | 1100. | ||
528.54 | 1200. | ||
545.08 | 1300. | ||
559.33 | 1400. | ||
571.64 | 1500. |
Constant pressure heat capacity of gas
Cp,gas (J/mol*K) | Temperature (K) | Reference | Comment |
---|---|---|---|
237.53 | 400. | Miyazawa T., 1958 | GT |
272.29 | 450. |

Condensed phase thermochemistry data

Data compiled as indicated in comments:
ALS - Hussein Y. Afeefy, Joel F. Liebman, and Stephen E. Stein
DH - Eugene S. Domalski and Elizabeth D. Hearing
Quantity | Value | Units | Method | Reference | Comment |
---|---|---|---|---|---|
ΔfH°liquid | -55.14 ± 0.22 | kcal/mol | Ccb | Speros and Rossini, 1960 | ALS |
ΔfH°liquid | -54.65 ± 0.32 | kcal/mol | Ccb | Davies and Gilbert, 1941 | Reanalyzed by Cox and Pilcher, 1970, Original value = -54.87 kcal/mol; ALS |
Quantity | Value | Units | Method | Reference | Comment |
ΔcH°liquid | -1500.23 ± 0.22 | kcal/mol | Ccb | Speros and Rossini, 1960 | Corresponding ΔfHºliquid = -55.12 kcal/mol (simple calculation by NIST; no Washburn corrections); ALS |
ΔcH°liquid | -1500.70 ± 0.30 | kcal/mol | Ccb | Davies and Gilbert, 1941 | Reanalyzed by Cox and Pilcher, 1970, Original value = -1500.3 ± 0.1 kcal/mol; Corresponding ΔfHºliquid = -54.65 kcal/mol (simple calculation by NIST; no Washburn corrections); ALS |
ΔcH°liquid | -1497.1 ± 0.5 | kcal/mol | Ccb | Huckel, Kamenz, et al., 1937 | Corresponding ΔfHºliquid = -58.2 kcal/mol (simple calculation by NIST; no Washburn corrections); ALS |
ΔcH°liquid | -1495.2 | kcal/mol | Ccb | Huckel and Mentzel, 1926 | Corresponding ΔfHºliquid = -60.1 kcal/mol (simple calculation by NIST; no Washburn corrections); ALS |
ΔcH°liquid | -1498.1 ± 1.1 | kcal/mol | Ccb | Roth and Lasse, 1925 | Corresponding ΔfHºliquid = -57.21 kcal/mol (simple calculation by NIST; no Washburn corrections); ALS |
Quantity | Value | Units | Method | Reference | Comment |
S°liquid | 63.320 | cal/mol*K | N/A | McCullough, Finke, et al., 1957 | DH |
Constant pressure heat capacity of liquid
Cp,liquid (cal/mol*K) | Temperature (K) | Reference | Comment |
---|---|---|---|
54.773 | 298.15 | Ohnishi, Fujihara, et al., 1989 | DH |
54.773 | 298.15 | Shiohama, Ogawa, et al., 1988 | DH |
54.773 | 298.15 | Shiohama, Ogawa, et al., 1988, 2 | DH |
59.89 | 313. | Gudinowicz, Campbell, et al., 1963 | T = 313 to 423 K.; DH |
54.610 | 298.15 | McCullough, Finke, et al., 1957 | T = 10 to 350 K.; DH |
54.221 | 298. | Seyer, 1953 | T = 293 to 413 K.; DH |
52.036 | 298.15 | Parks and Hatton, 1949 | T = 80 to 298.15 K.; DH |

Phase change data

Data compiled as indicated in comments:
BS - Robert L. Brown and Stephen E. Stein
TRC - Thermodynamics Research Center, NIST Boulder Laboratories, Chris Muzny director
ALS - Hussein Y. Afeefy, Joel F. Liebman, and Stephen E. Stein
DRB - Donald R. Burgess, Jr.
AC - William E. Acree, Jr., James S. Chickos
DH - Eugene S. Domalski and Elizabeth D. Hearing
CAL - James S. Chickos, William E. Acree, Jr., Joel F. Liebman, Students of Chem 202 (Introduction to the Literature of Chemistry), University of Missouri -- St. Louis
Quantity | Value | Units | Method | Reference | Comment |
---|---|---|---|---|---|
Tboil | 460. ± 3. | K | AVG | N/A | Average of 17 values; Individual data points |
Quantity | Value | Units | Method | Reference | Comment |
Tfus | 242. ± 2. | K | AVG | N/A | Average of 15 out of 16 values; Individual data points |
Quantity | Value | Units | Method | Reference | Comment |
Ttriple | 242.7700 | K | N/A | McCullough, Finke, et al., 1957, 2 | Uncertainty assigned by TRC = 0.07 K; TRC |
Ttriple | 242.7700 | K | N/A | McCullough, Finke, et al., 1957, 2 | Uncertainty assigned by TRC = 0.05 K; TRC |
Ttriple | 242.4 | K | N/A | Parks and Hatton, 1949, 2 | Uncertainty assigned by TRC = 0.2 K; TRC |
Quantity | Value | Units | Method | Reference | Comment |
Tc | 687. ± 3. | K | N/A | Daubert, 1996 | |
Tc | 960.15 | K | N/A | Cheng, McCoubrey, et al., 1962 | Uncertainty assigned by TRC = 1.3 K; extrapolated to zero time to correct for decomposition cal. vs NPL thermometer; TRC |
Quantity | Value | Units | Method | Reference | Comment |
ΔvapH° | 11.60 ± 0.50 | kcal/mol | V | Speros and Rossini, 1960 | ALS |
ΔvapH° | 11.6 | kcal/mol | N/A | Speros and Rossini, 1960 | DRB |
ΔvapH° | 10.24 | kcal/mol | C | Glaser and Ruland, 1957 | ALS |
Quantity | Value | Units | Method | Reference | Comment |
ΔsubH° | 15.4 | kcal/mol | H | Bondi, 1963 | See also Chickos, Hosseini, et al., 1993.; AC |
Reduced pressure boiling point
Tboil (K) | Pressure (atm) | Reference | Comment |
---|---|---|---|
458.2 | 0.995 | Aldrich Chemical Company Inc., 1990 | BS |
Enthalpy of vaporization
ΔvapH (kcal/mol) | Temperature (K) | Method | Reference | Comment |
---|---|---|---|---|
10.6 | 378. | A,GS | Stephenson and Malanowski, 1987 | Based on data from 363. to 461. K. See also Camin and Rossini, 1955.; AC |
Antoine Equation Parameters
log10(P) = A − (B / (T + C))
P = vapor pressure (atm)
T = temperature (K)
View plot Requires a JavaScript / HTML 5 canvas capable browser.
Temperature (K) | A | B | C | Reference | Comment |
---|---|---|---|---|---|
365.51 to 461.02 | 3.98733 | 1572.899 | -65.947 | Camin and Rossini, 1955 | Coefficents calculated by NIST from author's data. |
Enthalpy of sublimation
ΔsubH (kcal/mol) | Temperature (K) | Method | Reference | Comment |
---|---|---|---|---|
15.8 | 241. | B | Bondi, 1963 | AC |
Enthalpy of fusion
ΔfusH (kcal/mol) | Temperature (K) | Reference | Comment |
---|---|---|---|
0.7753 | 242.4 | Parks and Hatton, 1949 | DH |
2.27 | 230.2 | Domalski and Hearing, 1996 | AC |
Entropy of fusion
ΔfusS (cal/mol*K) | Temperature (K) | Reference | Comment |
---|---|---|---|
3.20 | 242.4 | Parks and Hatton, 1949 | DH |
Entropy of fusion
ΔfusS (cal/mol*K) | Temperature (K) | Reference | Comment |
---|---|---|---|
2.36 | 216.1 | Domalski and Hearing, 1996 | CAL |
9.852 | 230.2 |
Enthalpy of phase transition
ΔHtrs (kcal/mol) | Temperature (K) | Initial Phase | Final Phase | Reference | Comment |
---|---|---|---|---|---|
0.51040 | 216.1 | crystaline, II | crystaline, I | McCullough, Finke, et al., 1957 | DH |
2.268 | 230.18 | crystaline, I | liquid | McCullough, Finke, et al., 1957 | DH |
Entropy of phase transition
ΔStrs (cal/mol*K) | Temperature (K) | Initial Phase | Final Phase | Reference | Comment |
---|---|---|---|---|---|
2.36 | 216.1 | crystaline, II | crystaline, I | McCullough, Finke, et al., 1957 | DH |
9.852 | 230.18 | crystaline, I | liquid | McCullough, Finke, et al., 1957 | DH |

Reaction thermochemistry data

Data compiled by: Hussein Y. Afeefy, Joel F. Liebman, and Stephen E. Stein
Individual Reactions
By formula: C10H18 = C10H18
Quantity | Value | Units | Method | Reference | Comment |
---|---|---|---|---|---|
ΔrH° | -2.69 | kcal/mol | Eqk | Nuzzi, 1984 | liquid phase; GC |
ΔrH° | -3.19 | kcal/mol | Eqk | Nuzzi, 1984 | gas phase; GC |

Gas phase ion energetics data

Data evaluated as indicated in comments:
L - Sharon G. Lias
Data compiled as indicated in comments:
LLK - Sharon G. Lias, Rhoda D. Levin, and Sherif A. Kafafi
RDSH - Henry M. Rosenstock, Keith Draxl, Bruce W. Steiner, and John T. Herron
Quantity | Value | Units | Method | Reference | Comment |
---|---|---|---|---|---|
IE (evaluated) | 9.32 ± 0.05 | eV | N/A | N/A | L |
Ionization energy determinations
IE (eV) | Method | Reference | Comment |
---|---|---|---|
9.32 ± 0.05 | PI | Mikaya and Zaikin, 1980 | LLK |
9.383 ± 0.005 | EI | Mikaya and Zaikin, 1980 | LLK |
9.35 | PE | Dewar and Worley, 1969 | RDSH |
Appearance energy determinations
Ion | AE (eV) | Other Products | Method | Reference | Comment |
---|---|---|---|---|---|
C6H10+ | 11.29 ± 0.02 | ? | EI | Natalis, 1962 | RDSH |
C7H12+ | 11.04 ± 0.02 | C3H6 | EI | Natalis, 1962 | RDSH |

References

Zhang, Li, et al., 1992
Zhang, M.J.; Li, S.D.; Chen, B.J.,
Compositional studies of high-temperature coal tar by GC/FTIR analysis of light oil fractions,
Chromatographia, 1992, 33, 3/4, 138-146, https://doi.org/10.1007/BF02275894
. [all data]
Litvinenko, Isakova, et al., 1988
Litvinenko, G.S.; Isakova, L.A.; Rubanyk, N.N.,
Quantitative correlation between structure of stereoisomeric saturated cyclic compounds and gas-chromatographic retention indices. I. Methysubstituted,
Izv. AN Kaz. SSR, Ser. Khim., 1988, 5, 54-66. [all data]
Tiess, 1984
Tiess, D.,
Gaschromatographische Retentionsindices von 125 leicht- bis mittelflüchtigen organischen Substanzen toxikologisch-analytischer Relevanz auf SE-30,
Wiss. Z. Wilhelm-Pieck-Univ. Rostock Math. Naturwiss. Reihe, 1984, 33, 6-9. [all data]
Boneva, Papazova, et al., 1983
Boneva, St.; Papazova, D.; Dimov, N.,
Retention Indices of aromatic hydrocarbons on glass and metal capillary columns with stationary phase OV-101,
Jahrb. Chem. Tech. Hochschule Burgas, 1983, 18, 143-148. [all data]
Tóth, 1983
Tóth, T.,
Use of capillary gas chromatography in collecting retention and chemical information for the analysis of complex petrochemical mixtures,
J. Chromatogr., 1983, 279, 157-165, https://doi.org/10.1016/S0021-9673(01)93614-3
. [all data]
Bredael, 1982
Bredael, P.,
Retention indices of hydrocarbons on SE-30,
J. Hi. Res. Chromatogr. Chromatogr. Comm., 1982, 5, 6, 325-328, https://doi.org/10.1002/jhrc.1240050610
. [all data]
Macák, Nabivach, et al., 1982
Macák, J.; Nabivach, V.; Buryan, P.; Sindler, S.,
Dependence of retention indices of alkylbenzenes on their molecular structure,
J. Chromatogr., 1982, 234, 2, 285-302, https://doi.org/10.1016/S0021-9673(00)81867-1
. [all data]
Gerasimenko, Kirilenko, et al., 1981
Gerasimenko, V.A.; Kirilenko, A.V.; Nabivach, V.M.,
Capillary gas chromatography of aromatic compounds found in coal tar fractions,
J. Chromatogr., 1981, 208, 1, 9-16, https://doi.org/10.1016/S0021-9673(00)87953-4
. [all data]
Nabivach, Bur'yan, et al., 1978
Nabivach, V.M.; Bur'yan, P.; Matsak, I.,
Retention indices of aromatic hydrocarbons on a squalane capillary column,
Zh. Anal. Khim., 1978, 33, 7, 1108-1113. [all data]
Engewald, Epsch, et al., 1976
Engewald, W.; Epsch, K.; Welsch, Th.; Graefe, J.,
Molekülstruktur und Retentionsverhalten. VI. Retentionsverhalten von bicycle[n.m.0]alkanen bei der gas-adsorptions- und gas-verteilungs-chromatographie,
J. Chromatogr., 1976, 119, 119-128, https://doi.org/10.1016/S0021-9673(00)86776-X
. [all data]
Shlyakhov, Anvaer, et al., 1975
Shlyakhov, A.F.; Anvaer, B.I.; Zolotareva, O.V.; Romina, N.N.; Novikova, N.V.; Koreshkova, R.I.,
On the possibility of group indentification of hydrocarbons by gas chromatography from temperature coefficients of retention indices,
Zh. Anal. Khim., 1975, 30, 788-792. [all data]
Mitra, Mohan, et al., 1974
Mitra, G.D.; Mohan, G.; Sinha, A.,
Gas chromatographic analysis of complex hydrocarbon mixtures,
J. Chromatogr. A, 1974, 91, 633-648, https://doi.org/10.1016/S0021-9673(01)97944-0
. [all data]
Takeda and Yamamoto, 1972
Takeda, K.; Yamamoto, S.,
Gas chromatographic identification of 2,6-disubstituted-trans-decalins using retention indices,
Chem. Pharm. Bull., 1972, 20, 6, 1125-1130, https://doi.org/10.1248/cpb.20.1125
. [all data]
Schomburg, 1966
Schomburg, G.,
Gaschromatographische Retentionsdaten und struktur chemischer verbindungen. III. Alkylverzweigte und ungesättigte cyclische Kohlenwasserstoffe,
J. Chromatogr., 1966, 23, 18-41, https://doi.org/10.1016/S0021-9673(01)98653-4
. [all data]
Antheaume and Guiochon, 1965
Antheaume, J.; Guiochon, G.,
Application de la chromatographie en phase gazeuse à l'étude de la composition des fractions moyennes d'un brut pétrolier,
Bull. Soc. Chim. Fr., 1965, 2, 298-307. [all data]
Hayes and Pitzer, 1982
Hayes, P.C., Jr.; Pitzer, E.W.,
Characterizing petroleum- and shale-derived jet fuel distillates via temperature-programmed Kováts indices,
J. Chromatogr., 1982, 253, 179-198, https://doi.org/10.1016/S0021-9673(01)88376-X
. [all data]
Louis, 1971
Louis, R.,
Kovats-index-tafeln zur gaschromatographischen analyse von kohlenwasserstoffgemischen,
Erdoel Kohle Erdgas Petrochem., 1971, 24, 2, 88-94. [all data]
Haagen-Smit Laboratory, 1997
Haagen-Smit Laboratory,
Procedure for the detailed hydrocarbon analysis of gasolines by single column high efficiency (capillary) column gas chromatography, SOP NO. MLD 118, Revision No. 1.1, California Environmental Protection Agency, Air Resources Board, El Monte, California, 1997, 22. [all data]
Kallio, Jussila, et al., 2006
Kallio, M.; Jussila, M.; Rissanen, T.; Anttila, P.; Hartonen, K.; Reissell, A.; Vreuls, R.; Adahchour, M.; Hyotylainen, T.,
Comprehensive two-dimensional gas chromatography coupled to time-of-flight mass spectrometry in the identification of organic compounds in atmospheric aerosols from coniferous forest,
J. Chromatogr. A, 2006, 1125, 2, 234-243, https://doi.org/10.1016/j.chroma.2006.05.050
. [all data]
Song, Lai, et al., 2003
Song, C.; Lai, W.-C.; Madhusudan Reddy, K.; Wei, B.,
Chapter 7. Temperature-programmed retention indices for GC and GC-MS of hydrocarbon fuels and simulated distillation GC of heavy oils
in Analytical advances for hydrocarbon research, Hsu,C.S., ed(s)., Kluwer Academic/Plenum Publishers, New York, 2003, 147-193. [all data]
Sun and Stremple, 2003
Sun, G.; Stremple, P.,
Retention index characterization of flavor, fragrance, and many other compounds on DB-1 and DB-XLB, 2003, retrieved from http://www.chem.agilent.com/cag/cabu/pdf/b-0279.pdf. [all data]
Lai and Song, 1995
Lai, W.-C.; Song, C.,
Temperature-programmed retention indices for g.c. and g.c.-m.s. analysis of coal- and petroleum-derived liquid fuels,
Fuel, 1995, 74, 10, 1436-1451, https://doi.org/10.1016/0016-2361(95)00108-H
. [all data]
White, Hackett, et al., 1992
White, C.M.; Hackett, J.; Anderson, R.R.; Kail, S.; Spock, P.S.,
Linear temperature programmed retention indices of gasoline range hydrocarbons and chlorinated hydrocarbons on cross-linked polydimethylsiloxane,
J. Hi. Res. Chromatogr., 1992, 15, 2, 105-120, https://doi.org/10.1002/jhrc.1240150211
. [all data]
Steward and Pitzer, 1988
Steward, E.M.; Pitzer, E.W.,
Gas Chromatographic Analyses of Complex Hydrocarbon Mixtures Void of n-Paraffin Retention Index Markers Using Joint Mass Spectral and Retention Index Libraries,
J. Chromatogr. Sci., 1988, 26, 5, 218-222, https://doi.org/10.1093/chromsci/26.5.218
. [all data]
Haynes and Pitzer, 1985
Haynes, P.C., Jr.; Pitzer, E.W.,
Disengaging solutes in shale- and petroleum-derived jet fuels by altering GC programmed temperature rates,
J. Hi. Res. Chromatogr. Chromatogr. Comm., 1985, 8, 5, 230-242, https://doi.org/10.1002/jhrc.1240080504
. [all data]
Hayes and Pitzer, 1981
Hayes, P.C., Jr.; Pitzer, E.W.,
Kovats indices as a tool in characterizing hydrocarbon fuels in temperature programmed glass capillary gas chromatography. Part 1. Qualitative identification, Inhouse rpt. for Air Force Wright Aeronautical Labs., Air Force Wright Aeronautical Labs., Wright-Patterson AFB, Ohio, 1981, 75. [all data]
Yasuhara, Shiraishi, et al., 1997
Yasuhara, A.; Shiraishi, H.; Nishikawa, M.; Yamamoto, T.; Uehiro, T.; Nakasugi, O.; Okumura, T.; Kenmotsu, K.; Fukui, H.; Nagase, M.; Ono, Y.; Kawagoshi, Y.; Baba, K.; Noma, Y.,
Determination of organic components in leachates from hazardous waste disposal sites in Japan by gas chromatography-mass spectrometry,
J. Chromatogr. A, 1997, 774, 1-2, 321-332, https://doi.org/10.1016/S0021-9673(97)00078-2
. [all data]
Whitfield, Shea, et al., 1981
Whitfield, F.B.; Shea, S.R.; Gillen, K.J.; Shaw, K.J.,
Volatile components from the roots of Acacia pulchella R.Br. and their effect on Phytophthora cinnamomi rands,
Aust. J. Bot., 1981, 29, 2, 195-208, https://doi.org/10.1071/BT9810195
. [all data]
Nabivach and Gerasimenko, 1996
Nabivach, V.M.; Gerasimenko, V.A.,
Gas chromatographic retention characteristics of bicyclic aromatic hydrocarbons,
Coke and Chemistry (Rus), 1996, 6, 27-31. [all data]
Rang, Kurashova, et al., 1982
Rang, S.; Kurashova, E.Kh.; Musaev, I.A.; Strenze, T.V.; Joepera, E.; Eisen, O.; Sanin, P.I.,
Gas-chromatographic characteristics of stereoisomers of the bicyblo[4.4.0]decane series,
Neftekhimiya, 1982, 22, 3, 303-308. [all data]
Papazova and Pankova, 1975
Papazova, D.I.; Pankova, M.C.,
Identification of individual aromatic hydrocarbons in kerosene fraction (b.p. 150-250 °),
J. Chromatogr., 1975, 105, 2, 411-414, https://doi.org/10.1016/S0021-9673(01)82276-7
. [all data]
Vanek, Podrouzková, et al., 1970
Vanek, J.; Podrouzková, B.; Landa, S.,
Gas chromatographic behaviour of tricyclic saturated hydrocarbons. The relation between the retention indices and the stereochemical structure of the tricyclanes,
J. Chromatogr., 1970, 52, 77-86, https://doi.org/10.1016/S0021-9673(01)96546-X
. [all data]
Ferrand, 1962
Ferrand, R.,
Gas phase chromatography using retention indices for the analysis of tars and their hydrogenation products,
Journees internationales d'etude des methodes de separation immediate at de chromatographie; Org. sur l'initiative du IX., 1962, 132-140. [all data]
Al-Qudah, Muhaidat, et al., 2012
Al-Qudah, M.A.; Muhaidat, R.; Trawenh, I.N.; Jaber, H.I.; Abu Zarga, M.H.; Abu Orabi, S.T.,
Volatile constituents of leaves and bulbs of Gynandriris Sisyrinchicum and their antimicrobial activities,
Jordan J. Chem., 2012, 7, 3, 287-295. [all data]
Kotowska, Zalikowski, et al., 2012
Kotowska, U.; Zalikowski, M.; Isidorov, V.A.,
HS-SPME/GC-MS analysis of volatile and semi-volatile organic compounds emitted from municipal sewage sludge,
Environ. Monit. Asses., 2012, 184, 5, 2893-2907, https://doi.org/10.1007/s10661-011-2158-8
. [all data]
Supelco, 2012
Supelco, CatalogNo. 24160-U,
Petrocol DH Columns. Catalog No. 24160-U, 2012, retrieved from http://www.sigmaaldrich.com/etc/medialib/docs/Supelco/Datasheet/1/w97949.Par.0001.File.tmp/w97949.pdf. [all data]
Pontes, de Olivera, et al., 2007
Pontes, W.J.T.; de Olivera, J.C.G.; da Camara, C.A.G.; Lopes, A.C.H.R.; Gondim Jr.; de Olivera, J.V.; Barros, R.; Schwartz, M.O.E.,
Chemical composition and acaridical activity of the leaf and fruit essential oils of Protium heptaphyllum (Aubl.) Marchand (Burseraceae),
Acta Amazonica, 2007, 37, 1, 103-110, https://doi.org/10.1590/S0044-59672007000100012
. [all data]
Orav, Kailas, et al., 1999
Orav, A.; Kailas, T.; Muurisepp, M.; Kann, J.,
Composition of the oil from waste tires. 2. Fraction boiling at 160-180 0C,
Proc. Estonian Acad. Sci. Chem., 1999, 48, 3, 136-140. [all data]
Elizalde-González, Hutfliess, et al., 1996
Elizalde-González, M.P.; Hutfliess, M.; Hedden, K.,
Retention index system, adsorption characteristics, and sructure correlations of polycyclic aromatic hydrocarbons in fuels,
J. Hi. Res. Chromatogr., 1996, 19, 6, 345-352, https://doi.org/10.1002/jhrc.1240190608
. [all data]
Cornwell and Cordano, 2003
Cornwell, E.; Cordano, G.,
Nueva proposicion para predecir datos de retencion obtenidos mediante cromatografia de gases de hidrocarburos derivados de las naftas,
Revista de la Sociedad Quimica de Mexico, 2003, 47, 1, 38-43. [all data]
Waggott and Davies, 1984
Waggott, A.; Davies, I.W.,
Identification of organic pollutants using linear temperature programmed retention indices (LTPRIs) - Part II, 1984, retrieved from http://dwi.defra.gov.uk/research/completed-research/reports/dwi0383.pdf. [all data]
Peng, 1996
Peng, C.T.,
Gas chromatographic identification of aromatic hydrocarbons
in Liquid Scintillation Spectrometry, Cook, G.T.; Harkness, D.D.; MacKenzie, A.B.; Miller, B.F.; Scott, E.M., ed(s)., 1996, 221-232. [all data]
Peng, Yang, et al., 1991
Peng, C.T.; Yang, Z.C.; Ding, S.F.,
Prediction of rentention idexes. II. Structure-retention index relationship on polar columns,
J. Chromatogr., 1991, 586, 1, 85-112, https://doi.org/10.1016/0021-9673(91)80028-F
. [all data]