α-Furil
- Formula: C10H6O4
- Molecular weight: 190.1522
- IUPAC Standard InChIKey: SXPUVBFQXJHYNS-UHFFFAOYSA-N
- CAS Registry Number: 492-94-4
- Chemical structure:
View 3d structure (requires JavaScript / HTML 5) - Other names: Ethanedione, di-2-furanyl-; Furil; Bipyromucyl; Difuranylglyoxal; 2,2'-Furil; Bipryomucyl; Di-2-furylglyoxal; Difuroyl; 1,2-Ethanedione, 1,2-di-2-furanyl-; Di-2-furanylethanedione; NSC 5561

Condensed phase thermochemistry data

Data compiled by: Hussein Y. Afeefy, Joel F. Liebman, and Stephen E. Stein
Quantity | Value | Units | Method | Reference | Comment |
---|---|---|---|---|---|
ΔcH°solid | -4453.4 | kJ/mol | Ccb | Barker, 1925 | Corresponding ΔfHºsolid = -339. kJ/mol (simple calculation by NIST; no Washburn corrections) |

Gas phase ion energetics data

Data compiled by: John E. Bartmess
Electron affinity determinations
EA (eV) | Method | Reference | Comment |
---|---|---|---|
1.344 ± 0.087 | IMRE | Paul and Kebarle, 1989 | ΔGea(423 K) = -30.6±1 kcal/mol, ΔS(est) = -1±3 eu |

Normal alkane RI, non-polar column, temperature ramp

Column type | Active phase | I | Reference | Comment |
---|---|---|---|---|
Packed | OV-101 | 1544. | Zenkevich, Acevedo, et al., 1991 | Celite 545 (0.20-0.25 mm), 10. K/min; Column length: 1.2 m; Tstart: 100. C; Tend: 300. C |

References

Barker, 1925
Barker, M.F.,
Calorific value and constitution,
J. Phys. Chem., 1925, 29, 1345-1363. [all data]
Paul and Kebarle, 1989
Paul, G.; Kebarle, P.,
Electron Affinities of Cyclic Unsaturated Dicarbonyls: Maleic Anhydrides, Maleimides, and Cyclopentendione,
J. Am. Chem. Soc., 1989, 111, 2, 464, https://doi.org/10.1021/ja00184a009
. [all data]
Zenkevich, Acevedo, et al., 1991
Zenkevich, I.G.; Acevedo, J.M.; Aguilera, I.R.,
Increments of Gas Chromatographic Retention Indices for Characterization of Organic Reactions,
Vestn. St. Petersb. Univ. Ser. 4: Fiz. Khim, 1991, 2, 51-56. [all data]