7-Amino-2,3-dihydro-5-phenyl-1H-1,4-benzodiazepin-2-one
- Formula: C15H13N3O
- Molecular weight: 251.2832
- IUPAC Standard InChIKey: OYOUQHVDCKOOAL-UHFFFAOYSA-N
- CAS Registry Number: 4928-02-3
- Chemical structure:
View 3d structure (requires JavaScript / HTML 5) - Other names: 7-Aminonitrazepam; 7-Amino-5-phenyl-1,3-dihydro-2H-1,4-benzodiazepin-2-one

Kovats' RI, non-polar column, isothermal

Column type | Active phase | Temperature (C) | I | Reference | Comment |
---|---|---|---|---|---|
Packed | SE-30 | 250. | 2785. | Schütz, 1982 | N2 |
Packed | SE-30 | 250. | 2785. | Schuetz and Westenberger, 1979 | N2, Chromosorb G AW DMCS (80-100 mesh); Column length: 1.5 m |

Van Den Dool and Kratz RI, non-polar column, temperature ramp

Column type | Active phase | I | Reference | Comment |
---|---|---|---|---|
Capillary | VF-5MS | 2898.7 | Tretyakov, 2014 | 30. m/0.25 mm/0.25 μm, He; Tstart: 60. C; Tend: 270. C |

References

Schütz, 1982
Schütz, H.,
Benzodiazepines, Springer-Verlag, New York, 1982, 438. [all data]
Schuetz and Westenberger, 1979
Schuetz, H.; Westenberger, V.,
Gas chromatographic data of 31 benzodiazepines and metabolites,
J. Chromatogr., 1979, 169, 409-411, https://doi.org/10.1016/0021-9673(75)85071-0
. [all data]
Tretyakov, 2014
Tretyakov, K.V.,
Retention Data. NIST Mass Spectrometry Data Center., NIST Mass Spectrometry Data Center, 2014. [all data]