1,1'-Biphenyl, 3,3',4,4'-tetramethyl-
- Formula: C16H18
- Molecular weight: 210.3141
- IUPAC Standard InChIKey: YXBIAYXZUDJVEB-UHFFFAOYSA-N
- CAS Registry Number: 4920-95-0
- Chemical structure:
View 3d structure (requires JavaScript / HTML 5) - Other names: Biphenyl, 3,3',4,4'-tetramethyl-; 3,3',4,4'-Tetramethylbiphenyl; 3,3',4,4'-Tetramethyldiphenyl; 3,4,3',4'-Tetramethylbiphenyl

Phase change data

Data compiled by: Thermodynamics Research Center, NIST Boulder Laboratories, Chris Muzny director
Quantity | Value | Units | Method | Reference | Comment |
---|---|---|---|---|---|
Tfus | 350. | K | N/A | Pope and Bogert, 1937 | Uncertainty assigned by TRC = 3. K |
Tfus | 350. | K | N/A | Crossley and Hampshire, 1911 | Uncertainty assigned by TRC = 4. K |
Tfus | 349. | K | N/A | Crossley and Hampshire, 1911 | Uncertainty assigned by TRC = 4. K |
Tfus | 349. | K | N/A | Ullmann, 1904 | Uncertainty assigned by TRC = 4. K |

References

Pope and Bogert, 1937
Pope, G.W.; Bogert, M.T.,
J. Org. Chem., 1937, 2, 276. [all data]
Crossley and Hampshire, 1911
Crossley; Hampshire,
J. Chem. Soc., 1911, 99, 721. [all data]
Ullmann, 1904
Ullmann, F.,
Justus Liebigs Ann. Chem., 1904, 332, 38. [all data]