2,5-dimethyl-1,3,5-hexatriene
- Formula: C8H12
- Molecular weight: 108.1809
- IUPAC Standard InChIKey: ZVFFWOKVVPSTAL-UHFFFAOYSA-N
- CAS Registry Number: 4916-63-6
- Chemical structure:
View 3d structure (requires JavaScript / HTML 5) - Stereoisomers:

Phase change data

Data compiled by: Thermodynamics Research Center, NIST Boulder Laboratories, Chris Muzny director
Quantity | Value | Units | Method | Reference | Comment |
---|---|---|---|---|---|
Tboil | 398. | K | N/A | Bourguel and Rombaud, 1930 | Uncertainty assigned by TRC = 4. K |

References

Bourguel and Rombaud, 1930
Bourguel, M.; Rombaud, R.,
Bull. Soc. Chim. Fr., 1930, 47, 173. [all data]