3-Hexene, 3-methyl-, (Z)-
- Formula: C7H14
- Molecular weight: 98.1861
- IUPAC Standard InChIKey: FHHSSXNRVNXTBG-SREVYHEPSA-N
- CAS Registry Number: 4914-89-0
- Chemical structure:
View 3d structure (requires JavaScript / HTML 5) - Stereoisomers:
- Other names: (Z)-3-Methyl-3-hexene; cis-3-Methyl-3-Hexene; 3-Methyl-cis-3-hexene; 3-Methyl-3-hexene (cis); (Z)-3-Hexene, 3-methyl

Condensed phase thermochemistry data

Data compiled by: Hussein Y. Afeefy, Joel F. Liebman, and Stephen E. Stein
Quantity | Value | Units | Method | Reference | Comment |
---|---|---|---|---|---|
ΔcH°liquid | -4639.39 ± 0.92 | kJ/mol | Ccb | Rockenfeller and Rossini, 1961 | Derived from the ratio of Heat of combustion; Corresponding ΔfHºliquid = -116.0 kJ/mol (simple calculation by NIST; no Washburn corrections) |

Phase change data

Data compiled as indicated in comments:
BS - Robert L. Brown and Stephen E. Stein
TRC - Thermodynamics Research Center, NIST Boulder Laboratories, Chris Muzny director
AC - William E. Acree, Jr., James S. Chickos
ALS - Hussein Y. Afeefy, Joel F. Liebman, and Stephen E. Stein
Quantity | Value | Units | Method | Reference | Comment |
---|---|---|---|---|---|
Tboil | 368. ± 3. | K | AVG | N/A | Average of 6 values; Individual data points |
Quantity | Value | Units | Method | Reference | Comment |
ΔvapH° | 36.4 | kJ/mol | N/A | Reid, 1972 | AC |
ΔvapH° | 36.4 | kJ/mol | V | Camin and Rossini, 1960 | ALS |
Enthalpy of vaporization
ΔvapH (kJ/mol) | Temperature (K) | Method | Reference | Comment |
---|---|---|---|---|
35.4 | 322. | A | Stephenson and Malanowski, 1987 | Based on data from 307. to 375. K.; AC |
35.7 | 317. | MM | Camin and Rossini, 1960, 2 | Based on data from 302. to 368. K.; AC |

Reaction thermochemistry data

Data compiled by: Hussein Y. Afeefy, Joel F. Liebman, and Stephen E. Stein
Individual Reactions
By formula: H2 + C7H14 = C7H16
Quantity | Value | Units | Method | Reference | Comment |
---|---|---|---|---|---|
ΔrH° | -110.6 ± 0.4 | kJ/mol | Chyd | Rogers and Dejroongruang, 1988 | liquid phase; solvent: Hydrocarbone |

Kovats' RI, non-polar column, isothermal

Column type | Active phase | Temperature (C) | I | Reference | Comment |
---|---|---|---|---|---|
Capillary | Methyl Silicone | 30. | 694.6 | Soják, Addová, et al., 2002 | He; Column length: 150. m; Column diameter: 0.250 mm |
Capillary | Squalane | 30. | 684.0 | Soják, Addová, et al., 2002 | He; Column length: 93. m; Column diameter: 0.250 mm |
Capillary | OV-101 | 40. | 691. | Laub and Purnell, 1988 | |
Capillary | OV-101 | 60. | 691. | Laub and Purnell, 1988 | |
Capillary | OV-101 | 80. | 692. | Laub and Purnell, 1988 | |
Capillary | OV-101 | 50. | 691. | Boneva and Dimov, 1986 | 100. m/0.27 mm/0.9 μm, N2 |
Capillary | OV-101 | 70. | 691.3 | Boneva and Dimov, 1986 | 100. m/0.27 mm/0.9 μm, N2 |
Capillary | Squalane | 50. | 684.8 | Boneva and Dimov, 1986 | N2; Column length: 100. m; Column diameter: 0.25 mm |
Capillary | Squalane | 70. | 685.1 | Boneva and Dimov, 1986 | N2; Column length: 100. m; Column diameter: 0.25 mm |
Capillary | DB-1 | 40. | 695. | Lubeck and Sutton, 1984 | 60. m/0.264 mm/0.25 μm, H2 |
Capillary | HP-PONA | 40. | 695. | Lubeck and Sutton, 1984 | 50. m/0.21 mm/0.5 μm, H2 |
Capillary | Squalane | 50. | 684. | Mitra, 1981 | N2; Column length: 100. m; Column diameter: 0.25 mm |
Capillary | Squalane | 50. | 685. | Mitra, 1981 | N2; Column length: 100. m; Column diameter: 0.25 mm |
Capillary | Squalane | 50. | 684.5 | Bajus, Veselý, et al., 1979 | Column length: 100. m; Column diameter: 0.25 mm |
Capillary | Squalane | 70. | 685. | Bajus, Veselý, et al., 1979 | Column length: 100. m; Column diameter: 0.25 mm |
Capillary | Squalane | 50. | 685. | Chretien and Dubois, 1976 | |
Capillary | Squalane | 100. | 686.9 | Lulova, Leont'eva, et al., 1976 | He; Column length: 120. m; Column diameter: 0.25 mm |
Capillary | Squalane | 100. | 692.0 | Lulova, Leont'eva, et al., 1976 | He; Column length: 120. m; Column diameter: 0.25 mm |
Capillary | Squalane | 100. | 691.6 | Lulova, Leont'eva, et al., 1976 | He; Column length: 120. m; Column diameter: 0.25 mm |
Capillary | Squalane | 55. | 691.6 | Lulova, Leont'eva, et al., 1975 | He; Column length: 120. m; Column diameter: 0.25 mm |
Capillary | Squalane | 50. | 685. | Rijks and Cramers, 1974 | N2; Column length: 100. m; Column diameter: 0.25 mm |
Capillary | Squalane | 70. | 685. | Rijks and Cramers, 1974 | N2; Column length: 100. m; Column diameter: 0.25 mm |
Capillary | Squalane | 40. | 688. | Matukuma, 1969 | N2; Column length: 91.4 m; Column diameter: 0.25 mm |
Packed | Squalane | 27. | 692. | Hively and Hinton, 1968 | He, Chromosorb P; Column length: 15. m; Column diameter: 0.25 mm |
Packed | Squalane | 49. | 692. | Hively and Hinton, 1968 | He, Chromosorb P; Column length: 15. m; Column diameter: 0.25 mm |
Packed | Squalane | 67. | 692. | Hively and Hinton, 1968 | He, Chromosorb P; Column length: 15. m; Column diameter: 0.25 mm |
Packed | Squalane | 86. | 691. | Hively and Hinton, 1968 | He, Chromosorb P; Column length: 15. m; Column diameter: 0.25 mm |
Capillary | Squalane | 70. | 692. | Schomburg, 1967 | Ar; Column length: 100. m |
Packed | Squalane | 30. | 695. | Tourres, 1967 | H2; Column length: 10. m |
Packed | Squalane | 50. | 695. | Tourres, 1967 | H2; Column length: 10. m |

Kovats' RI, non-polar column, custom temperature program

Column type | Active phase | I | Reference | Comment |
---|---|---|---|---|
Capillary | Petrocol DH-100 | 694.8 | Haagen-Smit Laboratory, 1997 | He; Column length: 100. m; Column diameter: 0.2 mm; Program: 5C(10min) => 5C/min => 50C(48min) => 1.5C/min => 195C(91min) |
Capillary | DB-1 | 705. | Hoekman, 1993 | 60. m/0.32 mm/1.0 μm, He; Program: -40 C for 12 min; -40 - 125 C at 3 deg.min; 125-185 C at 6 deg/min; 185 - 220 C at 20 deg/min; hold 220 C for 2 min |

Van Den Dool and Kratz RI, non-polar column, temperature ramp

Column type | Active phase | I | Reference | Comment |
---|---|---|---|---|
Capillary | Methyl Silicone | 695.1 | Soják, Addová, et al., 2002 | He, 1. K/min; Column length: 150. m; Column diameter: 0.250 mm; Tstart: 30. C; Tend: 200. C |

Normal alkane RI, non-polar column, isothermal

Column type | Active phase | Temperature (C) | I | Reference | Comment |
---|---|---|---|---|---|
Capillary | Squalane | 40. | 684.3 | Sojak, Addova, et al., 2000 | He; Column length: 93. m; Column diameter: 0.25 mm |
Capillary | Methyl Silicone | 50. | 685. | N/A | N2; Column length: 74.6 m; Column diameter: 0.28 mm |
Capillary | Methyl Silicone | 50. | 692. | N/A | N2; Column length: 74.6 m; Column diameter: 0.28 mm |
Capillary | Squalane | 70. | 692. | Schomburg, 1966 |

Normal alkane RI, non-polar column, temperature ramp

Column type | Active phase | I | Reference | Comment |
---|---|---|---|---|
Capillary | Petrocol DH | 693. | Supelco, 2012 | 100. m/0.25 mm/0.50 μm, Helium, 20. C @ 15. min, 15. K/min, 220. C @ 30. min |
Capillary | PONA | 694. | Zhang, Ding, et al., 2009 | 50. m/0.20 mm/0.50 μm, Nitrogen, 35. C @ 15. min, 2. K/min, 200. C @ 10. min |
Capillary | SE-54 | 692. | Guan, Li, et al., 1995 | 60. C @ 2. min, 4. K/min; Column length: 50. m; Column diameter: 0.32 mm; Tend: 200. C |
Capillary | DB-1 | 695. | Ramnas, Ostermark, et al., 1994 | 50. m/0.32 mm/1.0 μm, He, 2. K/min; Tstart: -20. C |

Normal alkane RI, non-polar column, custom temperature program

Column type | Active phase | I | Reference | Comment |
---|---|---|---|---|
Capillary | Polydimethyl siloxane | 685. | Junkes, Castanho, et al., 2003 | Program: not specified |

References

Rockenfeller and Rossini, 1961
Rockenfeller, J.D.; Rossini, F.D.,
Heats of combustion, isomerization, and formation of selected C7, C8, and C10 monoolefin hydrocarbons,
J. Phys. Chem., 1961, 65, 267-272. [all data]
Reid, 1972
Reid, Robert C.,
Handbook on vapor pressure and heats of vaporization of hydrocarbons and related compounds, R. C. Wilhort and B. J. Zwolinski, Texas A Research Foundation. College Station, Texas(1971). 329 pages.$10.00,
AIChE J., 1972, 18, 6, 1278-1278, https://doi.org/10.1002/aic.690180637
. [all data]
Camin and Rossini, 1960
Camin, D.L.; Rossini, F.D.,
Physical properties of to selected C7 and C8 alkene hydrocarbons,
J. Chem. Eng. Data, 1960, 5, 368. [all data]
Stephenson and Malanowski, 1987
Stephenson, Richard M.; Malanowski, Stanislaw,
Handbook of the Thermodynamics of Organic Compounds, 1987, https://doi.org/10.1007/978-94-009-3173-2
. [all data]
Camin and Rossini, 1960, 2
Camin, D.L.; Rossini, F.D.,
Physical Properties of 16 Selected C 7 and C 8 Alkene Hydrocarbons.,
J. Chem. Eng. Data, 1960, 5, 3, 368-372, https://doi.org/10.1021/je60007a037
. [all data]
Rogers and Dejroongruang, 1988
Rogers, D.W.; Dejroongruang, K.,
Enthalpies of hydrogenation of the n-heptenes and the methylhexenes,
J. Chem. Thermodyn., 1988, 20, 675-680. [all data]