4H-1-Benzopyran-4-one, 2,3-dihydro-
- Formula: C9H8O2
- Molecular weight: 148.1586
- IUPAC Standard InChIKey: MSTDXOZUKAQDRL-UHFFFAOYSA-N
- CAS Registry Number: 491-37-2
- Chemical structure:
View 3d structure (requires JavaScript / HTML 5) - Other names: 4-Chromanone; Chroman-4-one; Chromanone; Isochromanone; 2,3-Dihydro-4-benzopyranone; 2,3-Dihydro-2-benzopyran-4-one; Chromonone

Phase change data

Data compiled as indicated in comments:
BS - Robert L. Brown and Stephen E. Stein
AC - William E. Acree, Jr., James S. Chickos
Quantity | Value | Units | Method | Reference | Comment |
---|---|---|---|---|---|
ΔsubH° | 84.6 ± 1.3 | kJ/mol | C | Matos, Sousa, et al., 2009 | AC |
Reduced pressure boiling point
Tboil (K) | Pressure (bar) | Reference | Comment |
---|---|---|---|
400.2 | 0.017 | Weast and Grasselli, 1989 | BS |
Enthalpy of fusion
ΔfusH (kJ/mol) | Temperature (K) | Method | Reference | Comment |
---|---|---|---|---|
16.7 | 312.3 | DSC | Matos, Sousa, et al., 2009 | AC |

Kovats' RI, non-polar column, isothermal

Column type | Active phase | Temperature (C) | I | Reference | Comment |
---|---|---|---|---|---|
Packed | Apiezon L | 170. | 1390. | Arruda, Heinzen, et al., 1993 | N2, Chromosorb W; Column length: 1.8 m |

Normal alkane RI, polar column, custom temperature program

Column type | Active phase | I | Reference | Comment |
---|---|---|---|---|
Capillary | SOLGel-Wax | 2442. | Shu and Shen, 2008 | 30. m/0.53 mm/0.50 μm, Helium; Program: 40 0C 7 0C/min -> 180 0C 10 0C/min -> 240 0C (10 min) |
Capillary | SOLGel-Wax | 2450. | Shu and Shen, 2008 | 30. m/0.53 mm/0.50 μm, Helium; Program: not specified |

References

Matos, Sousa, et al., 2009
Matos, M. Agostinha R.; Sousa, Clara C.S.; Morais, Victor M.F.,
Experimental and computational thermochemistry of the isomers: Chromanone, 3-isochromanone, and dihydrocoumarin,
The Journal of Chemical Thermodynamics, 2009, 41, 3, 308-314, https://doi.org/10.1016/j.jct.2008.08.012
. [all data]
Weast and Grasselli, 1989
CRC Handbook of Data on Organic Compounds, 2nd Editon, Weast,R.C and Grasselli, J.G., ed(s)., CRC Press, Inc., Boca Raton, FL, 1989, 1. [all data]
Arruda, Heinzen, et al., 1993
Arruda, A.C.; Heinzen, V.E.F.; Yunes, R.A.,
Relationship between Kovats retention indices and molecular connectivity indices of tetralones, coumarins and structurally related compounds,
J. Chromatogr., 1993, 630, 1-2, 251-256, https://doi.org/10.1016/0021-9673(93)80461-G
. [all data]
Shu and Shen, 2008
Shu, N.; Shen, H.,
Aroma-impact compounds in Lysimachia foenum-graecum extracts,
Flavour Fragr. J., 2008, 24, 1, 1-6, https://doi.org/10.1002/ffj.1908
. [all data]