Benzoic acid, 2,4,5-trimethoxy-
- Formula: C10H12O5
- Molecular weight: 212.1993
- IUPAC Standard InChIKey: KVZUCOGWKYOPID-UHFFFAOYSA-N
- CAS Registry Number: 490-64-2
- Chemical structure:
View 3d structure (requires JavaScript / HTML 5) - Other names: 2,4,5-Trimethoxybenzoic acid; Calamonic acid

Phase change data

Data compiled by: William E. Acree, Jr., James S. Chickos
Enthalpy of fusion
ΔfusH (kJ/mol) | Temperature (K) | Method | Reference | Comment |
---|---|---|---|---|
31.15 | 417.9 | DSC | Huang, 2003 | See also Huang, Tang, et al., 2005. |

Van Den Dool and Kratz RI, non-polar column, custom temperature program

Column type | Active phase | I | Reference | Comment |
---|---|---|---|---|
Capillary | HP-5MS | 1927.9 | Andriamaharavo, 2014 | 30. m/0.25 mm/0.25 μm, He; Program: 60C (1 min) => 5 C/min => 210C => 10 C/min => 280C (15 min) |

References

Huang, 2003
Huang, C.-Y.,
, M.S. Thesis, Chinese Culture University, 2003. [all data]
Huang, Tang, et al., 2005
Huang, Chih-Yung; Tang, Muoi; Chen, Yan-Ping,
Solid-Liquid Equilibria for 3-Aminophenol + 2-Aminophenol, 4-(Acetylamino)toluene + 2-(Acetylamino)toluene, and 3,4,5-Trimethoxybenzoic Acid + 2,4,5-Trimethoxybenzoic Acid,
J. Chem. Eng. Data, 2005, 50, 1, 40-43, https://doi.org/10.1021/je049878m
. [all data]
Andriamaharavo, 2014
Andriamaharavo, N.R.,
Retention Data. NIST Mass Spectrometry Data Center., NIST Mass Spectrometry Data Center, 2014. [all data]