CH3C(O)OCH(CH3)C(O)CH3
- Formula: C6H10O3
- Molecular weight: 130.1418
- IUPAC Standard InChIKey: ZKPTYCJWRHHBOW-UHFFFAOYSA-N
- CAS Registry Number: 4906-24-5
- Chemical structure:
View 3d structure (requires JavaScript / HTML 5) - Species with the same structure:
- Other names: 2-Acetoxy-3-butanone; 3-acetoxy-2-butanone; 2-Butanon-3-ol, acetate; 3-(acetyloxy)-2-butanone; 2-Ketobutan-3-yl acetate; 3-Hydroxy-2-butanone, acetate; 3-oxo-2-butyl acetate; 2-Butanone, 3-(acetyloxy)-; Acetoin Acetate; 3-oxobutan-2-yl acetate

Van Den Dool and Kratz RI, non-polar column, custom temperature program

Column type | Active phase | I | Reference | Comment |
---|---|---|---|---|
Capillary | VF-5MS | 888. | Tret'yakov, 2008 | 30. m/0.25 mm/0.25 μm, He; Program: Multi-step temperature program; T(initial)=60C; T(final)=270C |

Van Den Dool and Kratz RI, polar column, temperature ramp

Column type | Active phase | I | Reference | Comment |
---|---|---|---|---|
Capillary | DB-Wax Etr | 1389. | Aubert C. and Pitrat M., 2006 | 30. m/0.25 mm/0.25 μm, He, 40. C @ 3. min, 5. K/min, 250. C @ 15. min |
Capillary | DB-FFAP | 1389. | Charles, Martin, et al., 2000 | 30. m/0.32 mm/0.25 μm, H2, 40. C @ 2. min, 5. K/min; Tend: 240. C |
Capillary | DB-Wax | 1377. | Umano, Hagi, et al., 1992 | He, 40. C @ 10. min, 2. K/min; Column length: 30. m; Column diameter: 0.25 mm; Tend: 200. C |
Capillary | DB-Wax | 1358. | Fröhlich, Duque, et al., 1989 | 30. m/0.25 mm/0.25 μm, He, 50. C @ 3. min, 4. K/min; Tend: 250. C |
Capillary | DB-Wax | 1361. | Fröhlich, Duque, et al., 1989 | 30. m/0.25 mm/0.25 μm, He, 50. C @ 3. min, 4. K/min; Tend: 250. C |

Normal alkane RI, non-polar column, temperature ramp

Column type | Active phase | I | Reference | Comment |
---|---|---|---|---|
Capillary | DB-1 | 852. | Shiota, 1993 | 30. m/0.25 mm/0.25 μm, He, 50. C @ 3. min, 5. K/min; Tend: 240. C |
Capillary | DB-1 | 856. | Shiota, 1993 | 30. m/0.25 mm/0.25 μm, He, 50. C @ 3. min, 5. K/min; Tend: 240. C |
Capillary | DB-1 | 855. | Shiota, 1991 | 60. m/0.25 mm/0.25 μm, He, 3. K/min; Tstart: 50. C; Tend: 240. C |
Capillary | DB-1 | 856. | Shiota, 1991 | 60. m/0.25 mm/0.25 μm, He, 3. K/min; Tstart: 50. C; Tend: 240. C |

Normal alkane RI, polar column, temperature ramp

Column type | Active phase | I | Reference | Comment |
---|---|---|---|---|
Capillary | DB-Wax | 1378. | Hayata, Sakamoto, et al., 2002 | 60. m/0.25 mm/0.25 μm, He, 40. C @ 10. min, 3. K/min, 220. C @ 10. min |

References

Tret'yakov, 2008
Tret'yakov, K.V.,
Retention Data. NIST Mass Spectrometry Data Center., NIST Mass Spectrometry Data Center, 2008. [all data]
Aubert C. and Pitrat M., 2006
Aubert C.; Pitrat M.,
Volatile compounds in the skin and pulp of Queen Anne's pocket melon,
J. Agric. Food Chem., 2006, 54, 21, 8177-8182, https://doi.org/10.1021/jf061415s
. [all data]
Charles, Martin, et al., 2000
Charles, M.; Martin, B.; Ginies, C.; Etievant, P.; Coste, G.; Guichard, E.,
Potent aroma compounds of two red wine vinegars,
J. Agric. Food Chem., 2000, 48, 1, 70-77, https://doi.org/10.1021/jf9905424
. [all data]
Umano, Hagi, et al., 1992
Umano, K.; Hagi, Y.; Nakahara, K.; Shoji, A.; Shibamoto, T.,
Volatile constituents of green and ripened pineapple (Aanas comosus [L.] Merr.),
J. Agric. Food Chem., 1992, 40, 4, 599-603, https://doi.org/10.1021/jf00016a014
. [all data]
Fröhlich, Duque, et al., 1989
Fröhlich, O.; Duque, C.; Schreier, P.,
Volatile constituents of curuba (Passiflora mollissima) fruit,
J. Agric. Food Chem., 1989, 37, 2, 421-425, https://doi.org/10.1021/jf00086a033
. [all data]
Shiota, 1993
Shiota, H.,
New esteric components in the volatiles of banana fruit (Musa sapientum L.),
J. Agric. Food Chem., 1993, 41, 11, 2056-2062, https://doi.org/10.1021/jf00035a046
. [all data]
Shiota, 1991
Shiota, H.,
Volatile components of pawpaw fruit (Asimina triloba Dunal.),
J. Agric. Food Chem., 1991, 39, 9, 1631-1635, https://doi.org/10.1021/jf00009a019
. [all data]
Hayata, Sakamoto, et al., 2002
Hayata, Y.; Sakamoto, T.; Kozuka, H.; Sakamoto, K.; Osajima, Y.,
Analysis of aromatic volatile compounds in 'Miyabi' melon (Cucumis melo L.) using the Porapak Q column,
J. Jpn. Soc. Hortic. Sci., 2002, 71, 4, 517-525, https://doi.org/10.2503/jjshs.71.517
. [all data]