1,5,9-Cyclododecatriene
- Formula: C12H18
- Molecular weight: 162.2713
- IUPAC Standard InChIKey: ZOLLIQAKMYWTBR-MOLCZBCNSA-N
- CAS Registry Number: 4904-61-4
- Chemical structure:
View 3d structure (requires JavaScript / HTML 5) - Species with the same structure:
- Stereoisomers:
- Other names: CDT; Cyclododecatriene; cis,trans,trans-Cyclododeca-1,5,9-triene; 1,5,9-Cyclododecatriene (Z,E,E); UN 2518; 1,5,9-Cyclooctatriene; cyclododeca-1,5,9-triene; 1-cis-5-trans-9-trans-cyclododecatriene

Phase change data

Data compiled by: William E. Acree, Jr., James S. Chickos
Enthalpy of vaporization
ΔvapH (kJ/mol) | Temperature (K) | Method | Reference | Comment |
---|---|---|---|---|
49.9 | 359. | A | Stephenson and Malanowski, 1987 | Based on data from 344. to 387. K. |
60.0 | 411. | A | Stephenson and Malanowski, 1987 | Based on data from 400. to 423. K. |
47.8 | 441. | A | Stephenson and Malanowski, 1987 | Based on data from 426. to 503. K. |

Normal alkane RI, non-polar column, custom temperature program

Column type | Active phase | I | Reference | Comment |
---|---|---|---|---|
Capillary | Squalane | 1256. | Chen, 2008 | Program: not specified |

References

Stephenson and Malanowski, 1987
Stephenson, Richard M.; Malanowski, Stanislaw,
Handbook of the Thermodynamics of Organic Compounds, 1987, https://doi.org/10.1007/978-94-009-3173-2
. [all data]
Chen, 2008
Chen, H.-F.,
Quantitative prediction of gas chromatography retention indices with support vector machines, radial basis neutral networks and multiple linear regression,
Anal. Chim. Acta, 2008, 609, 1, 24-36, https://doi.org/10.1016/j.aca.2008.01.003
. [all data]