Naphthalene, 1-methoxy-4-nitro-
- Formula: C11H9NO3
- Molecular weight: 203.1941
- IUPAC Standard InChIKey: YFJKGPRYPHFGQD-UHFFFAOYSA-N
- CAS Registry Number: 4900-63-4
- Chemical structure:
View 3d structure (requires JavaScript / HTML 5) - Other names: 1-Methoxy-4-nitronaphthalene; 1-Nitro-4-methoxynaphthalene; methyl 4-nitronaphthyl ether

Gas phase ion energetics data

Data compiled by: John E. Bartmess
Electron affinity determinations
EA (eV) | Method | Reference | Comment |
---|---|---|---|
1.10 ± 0.10 | IMRE | Heinis, Chowdhury, et al., 1993 | ΔGea(423 K)= -24.5 kcal/mol , ΔSea=-2.0 (entropy estimated) |

References

Heinis, Chowdhury, et al., 1993
Heinis, T.; Chowdhury, S.; Kebarle, P.,
Electron Affinities of Naphthalene, Anthracene and Substituted Naphthalenes and Anthracenes,
Org. Mass Spectrom., 1993, 28, 4, 358, https://doi.org/10.1002/oms.1210280416
. [all data]