3-Methyl-6-isopropylcatechol
- Formula: C10H14O2
- Molecular weight: 166.2170
- CAS Registry Number: 490-06-2

Gas phase thermochemistry data

Data compiled by: Hussein Y. Afeefy, Joel F. Liebman, and Stephen E. Stein
Quantity | Value | Units | Method | Reference | Comment |
---|---|---|---|---|---|
ΔfH°gas | -90.61 ± 0.43 | kcal/mol | Ccb | Ribeiro Da Silva and Ribeiro Da Silva, 1984 |

Condensed phase thermochemistry data

Data compiled by: Hussein Y. Afeefy, Joel F. Liebman, and Stephen E. Stein
Quantity | Value | Units | Method | Reference | Comment |
---|---|---|---|---|---|
ΔfH°solid | -113.7 ± 0.38 | kcal/mol | Ccb | Ribeiro Da Silva and Ribeiro Da Silva, 1984 | |
Quantity | Value | Units | Method | Reference | Comment |
ΔcH°solid | -1305.0 ± 0.2 | kcal/mol | Ccb | Ribeiro Da Silva and Ribeiro Da Silva, 1984 | Corresponding ΔfHºsolid = -113.7 kcal/mol (simple calculation by NIST; no Washburn corrections) |

Phase change data

Data compiled as indicated in comments:
AC - William E. Acree, Jr., James S. Chickos
ALS - Hussein Y. Afeefy, Joel F. Liebman, and Stephen E. Stein
DRB - Donald R. Burgess, Jr.
Quantity | Value | Units | Method | Reference | Comment |
---|---|---|---|---|---|
ΔsubH° | 23.1 ± 0.2 | kcal/mol | C | Carson, 1984 | AC |
ΔsubH° | 23.1 ± 0.2 | kcal/mol | C | Ribeiro Da Silva and Ribeiro Da Silva, 1984 | ALS |
ΔsubH° | 23.1 | kcal/mol | N/A | Ribeiro Da Silva and Ribeiro Da Silva, 1984 | DRB |

References

Ribeiro Da Silva and Ribeiro Da Silva, 1984
Ribeiro Da Silva, M.D.M.C.; Ribeiro Da Silva, M.A.V.,
Enthalpies of combustion of 1,2-dihydroxybenzene and of six alkylsubstituted 1,2-dihydroxybenzenes,
J. Chem. Thermodyn., 1984, 16, 1149-1155. [all data]
Carson, 1984
Carson, A.S.,
The molar enthalpy of dehydration of Cr2(O2CCH3)4·2H2O(cr) and the molar enthalpies of sublimation of Cr2(O2CCH3)4(cr), Mo2(O2CCH3)4(cr), and Mo2(O2CCF3)4(cr),
The Journal of Chemical Thermodynamics, 1984, 16, 5, 427-429, https://doi.org/10.1016/0021-9614(84)90198-8
. [all data]