Benzenamine, 2,4,6-trinitro-
- Formula: C6H4N4O6
- Molecular weight: 228.1192
- IUPAC Standard InChIKey: IAHOUQOWMXVMEH-UHFFFAOYSA-N
- CAS Registry Number: 489-98-5
- Chemical structure:
View 3d structure (requires JavaScript / HTML 5) - Other names: Aniline, 2,4,6-trinitro-; Picramide; 2,4,6-Trinitroaniline

Condensed phase thermochemistry data

Data compiled by: Hussein Y. Afeefy, Joel F. Liebman, and Stephen E. Stein
Quantity | Value | Units | Method | Reference | Comment |
---|---|---|---|---|---|
ΔfH°solid | -72.8 | kJ/mol | Ccb | Medard and Thomas, 1949 | Author was aware that data differs from previously reported values; Author's hf298_condensed=-20.2 kcal/mol |
ΔfH°solid | -115.9 | kJ/mol | Ccb | Rinkenbach, 1930 | Author hf298_condensed[kcal/mol]=-29.95 |
Quantity | Value | Units | Method | Reference | Comment |
ΔcH°solid | -2860.1 | kJ/mol | Ccb | Medard and Thomas, 1949 | Author was aware that data differs from previously reported values; Author's hf298_condensed=-20.2 kcal/mol |
ΔcH°solid | -2816.87 | kJ/mol | Ccb | Rinkenbach, 1930 | Author hf298_condensed[kcal/mol]=-29.95 |

Phase change data

Data compiled by: William E. Acree, Jr., James S. Chickos
Quantity | Value | Units | Method | Reference | Comment |
---|---|---|---|---|---|
ΔsubH° | 125.3 ± 0.8 | kJ/mol | ME | Cundall, Frank Palmer, et al., 1978 | Based on data from 326. to 449. K. |
Enthalpy of sublimation
ΔsubH (kJ/mol) | Temperature (K) | Method | Reference | Comment |
---|---|---|---|---|
115.9 | 343. | LE | Stephenson and Malanowski, 1987 | Based on data from 328. to 371. K. See also Rosen and Dickinson, 1969. |

Lee's RI, non-polar column, temperature ramp

Column type | Active phase | I | Reference | Comment |
---|---|---|---|---|
Capillary | DB-5MS | 337.56 | Chen, Keeran, et al., 2002 | 30. m/0.25 mm/0.5 μm, 40. C @ 1. min, 10. K/min; Tend: 310. C |

References

Medard and Thomas, 1949
Medard, L.; Thomas, M.,
Determinations calorimetriques concernant dix-huit derives nitres ou nitrates organiques.,
Mem. Poudres, 1949, 29, 173-195. [all data]
Rinkenbach, 1930
Rinkenbach, W.H.,
The heats of combustion and formation of aromatic nitro compounds,
J. Am. Chem. Soc., 1930, 52, 115-120. [all data]
Cundall, Frank Palmer, et al., 1978
Cundall, Robert B.; Frank Palmer, T.; Wood, Colin E.C.,
Vapour pressure measurements on some organic high explosives,
J. Chem. Soc., Faraday Trans. 1, 1978, 74, 0, 1339, https://doi.org/10.1039/f19787401339
. [all data]
Stephenson and Malanowski, 1987
Stephenson, Richard M.; Malanowski, Stanislaw,
Handbook of the Thermodynamics of Organic Compounds, 1987, https://doi.org/10.1007/978-94-009-3173-2
. [all data]
Rosen and Dickinson, 1969
Rosen, Jerome M.; Dickinson, Charles,
Vapor pressures and heats of sublimation of some high-melting organic explosives,
J. Chem. Eng. Data, 1969, 14, 1, 120-124, https://doi.org/10.1021/je60040a044
. [all data]
Chen, Keeran, et al., 2002
Chen, P.H.; Keeran, W.S.; Van Ausdale, W.A.; Schindler, D.R.; Roberts, D.W.,
Application of Lee retention indices to the confirmation of tentatively identified compounds from GC/MS analysis of environmental samples, Technical paper, Analytical Services Division, Environmental ScienceEngineering, Inc, PO Box 1703, Gainesville, FL 32602, 2002, 11. [all data]