Propiolic acid, 3-phenyl-, methyl ester
- Formula: C10H8O2
- Molecular weight: 160.1693
- IUPAC Standard InChIKey: JFGWPXKGINUNDH-UHFFFAOYSA-N
- CAS Registry Number: 4891-38-7
- Chemical structure:
View 3d structure (requires JavaScript / HTML 5) - Other names: 2-Propynoic acid, 3-phenyl-, methyl ester; Methyl 3-phenyl-2-propynoate; Methyl 3-phenylpropiolate; Methyl 3-phenylpropynoate; Methyl phenylacetylenecarboxylate; Methyl phenylethynecarboxylate; Methyl phenylpropiolate; Methyl phenylpropynoate; Propiolic acid, phenyl-, methyl ester; 2-Phenyl-1-carbomethoxyacetylene; Phenylpropynoic acid methyl ester

Condensed phase thermochemistry data

Data compiled as indicated in comments:
DRB - Donald R. Burgess, Jr.
ALS - Hussein Y. Afeefy, Joel F. Liebman, and Stephen E. Stein
Quantity | Value | Units | Method | Reference | Comment |
---|---|---|---|---|---|
ΔfH°liquid | -68.5 ± 5.0 | kJ/mol | Ccb | N/A | recalculated with modern CO2,H2O thermo; estimated uncertainty (NOTE all values in source also have wrong sign); DRB |
ΔfH°liquid | 99.6 | kJ/mol | Ccb | Moureu and Andre, 1914 | ALS |
Quantity | Value | Units | Method | Reference | Comment |
ΔcH°liquid | -5009.9 | kJ/mol | Ccb | Moureu and Andre, 1914 | Corresponding ΔfHºliquid = -68.6 kJ/mol (simple calculation by NIST; no Washburn corrections); ALS |

Phase change data

Data compiled by: Thermodynamics Research Center, NIST Boulder Laboratories, Chris Muzny director
Quantity | Value | Units | Method | Reference | Comment |
---|---|---|---|---|---|
Tfus | 290. | K | N/A | Padoa, 1919 | Uncertainty assigned by TRC = 1. K |

References

Moureu and Andre, 1914
Moureu, C.; Andre, E.,
Thermochimie des composes acetyleniques,
Ann. Chim. Phys., 1914, 1, 113-145. [all data]
Padoa, 1919
Padoa, M.,
Atti Accad. Naz. Lincei, Cl. Sci. Fis., Mat. Nat., Rend., 1919, 28, 239. [all data]