3-Furancarboxylic acid
- Formula: C5H4O3
- Molecular weight: 112.0835
- IUPAC Standard InChIKey: IHCCAYCGZOLTEU-UHFFFAOYSA-N
- CAS Registry Number: 488-93-7
- Chemical structure:
View 3d structure (requires JavaScript / HTML 5) - Other names: 3-Furoic acid

Phase change data

Data compiled by: William E. Acree, Jr., James S. Chickos
Quantity | Value | Units | Method | Reference | Comment |
---|---|---|---|---|---|
ΔsubH° | 87.1 ± 0.5 | kJ/mol | ME | Roux, Temprado, et al., 2003 | Based on data from 283. to 298. K. |
Enthalpy of fusion
ΔfusH (kJ/mol) | Temperature (K) | Method | Reference |
---|---|---|---|
21.3 | 394.8 | DSC | Roux, Temprado, et al., 2004 |

Van Den Dool and Kratz RI, non-polar column, temperature ramp

Column type | Active phase | I | Reference | Comment |
---|---|---|---|---|
Capillary | VF-5MS | 1004. | Todua, 2011 | 30. m/0.25 mm/0.25 μm, He; Tstart: 60. C; Tend: 270. C |

References

Roux, Temprado, et al., 2003
Roux, Maria Victoria; Temprado, Manuel; Jiménez, Pilar; Pérez-Parajón, Pilar; Notario, Rafael,
Thermochemistry of Furancarboxylic Acids,
J. Phys. Chem. A, 2003, 107, 51, 11460-11467, https://doi.org/10.1021/jp030772s
. [all data]
Roux, Temprado, et al., 2004
Roux, Maria Victoria; Temprado, Manuel; Jiménez, Pilar; Foces-Foces, Concepción; Garcia, Maria Victoria; Redondo, Maria Isabel,
2- and 3-furancarboxylic acids: a comparative study using calorimetry, IR spectroscopy and X-ray crystallography,
Thermochimica Acta, 2004, 420, 1-2, 59-66, https://doi.org/10.1016/j.tca.2003.12.031
. [all data]
Todua, 2011
Todua, N.G.,
Retention Data. NIST Mass Spectrometry Data Center., NIST Mass Spectrometry Data Center, 2011. [all data]