D-erythro-pent-2-ulose
- Formula: C5H10O5
- Molecular weight: 150.1299
- IUPAC Standard InChIKey: ZAQJHHRNXZUBTE-UCORVYFPSA-N
- CAS Registry Number: 488-84-6
- Chemical structure:
View 3d structure (requires JavaScript / HTML 5) - Other names: D-Ribulose

Reaction thermochemistry data

Data compiled by: Hussein Y. Afeefy, Joel F. Liebman, and Stephen E. Stein
Individual Reactions
By formula: C5H10O5 = C5H10O5
Quantity | Value | Units | Method | Reference | Comment |
---|---|---|---|---|---|
ΔrH° | -20.8 ± 3.4 | kJ/mol | Ciso | Tewari and Goldberg, 1985 | solid phase; solvent: Water |
By formula: C5H10O5 = C5H10O5
Quantity | Value | Units | Method | Reference | Comment |
---|---|---|---|---|---|
ΔrH° | 11.0 ± 1.5 | kJ/mol | Ciso | Tewari and Goldberg, 1985 | solid phase; solvent: Water |

References

Tewari and Goldberg, 1985
Tewari, Y.B.; Goldberg, R.N.,
An investigation of the equilibria between aqueous ribose, ribulose, and arabinose,
Biophys. Chem., 1985, 22, 197-204. [all data]