Hexanoic acid, octyl ester
- Formula: C14H28O2
- Molecular weight: 228.3709
- IUPAC Standard InChIKey: CMNMHJVRZHGAAK-UHFFFAOYSA-N
- CAS Registry Number: 4887-30-3
- Chemical structure:
View 3d structure (requires JavaScript / HTML 5) - Other names: n-Octyl hexanoate; Octyl hexanoate; Octyl caproate

Phase change data

Data compiled by: Thermodynamics Research Center, NIST Boulder Laboratories, Chris Muzny director
Quantity | Value | Units | Method | Reference | Comment |
---|---|---|---|---|---|
Tboil | 548.4 | K | N/A | Bilterys and Gisseleire, 1935 | Uncertainty assigned by TRC = 1.5 K |
Tboil | 548.4 | K | N/A | Gartenmeister, 1886 | Uncertainty assigned by TRC = 2. K |
Tboil | 543. | K | N/A | Zincke, 1869 | Uncertainty assigned by TRC = 4. K |
Quantity | Value | Units | Method | Reference | Comment |
Tfus | 245.1 | K | N/A | Bilterys and Gisseleire, 1935 | Uncertainty assigned by TRC = 1. K |

Van Den Dool and Kratz RI, non-polar column, temperature ramp

Data compiled by: NIST Mass Spectrometry Data Center, William E. Wallace, director

Column type Capillary
Active phase CP Sil 5 CB
Column length (m) 25.
Carrier gas
Substrate
Column diameter (mm) 0.22
Phase thickness (μm)
Tstart (C) 70.
Tend (C) 205.
Heat rate (K/min) 4.
Initial hold (min)
Final hold (min)
I 1570.
ReferenceHendriks and Bruins, 1983
Comment MSDC-RI

Normal alkane RI, polar column, custom temperature program

Data compiled by: NIST Mass Spectrometry Data Center, William E. Wallace, director

Column type Capillary
Active phase HP Innowax FSP
Column length (m) 60.
Carrier gas N2
Substrate
Column diameter (mm) 0.25
Phase thickness (μm) 0.25
Program 60C(10min) => 4C/min => 220C(10min) => 1C/min => 240C
I 1829.
ReferenceTabanca N., Demirci B., et al., 2007
Comment MSDC-RI

Normal alkane RI, non-polar column, custom temperature program

Data compiled by: NIST Mass Spectrometry Data Center, William E. Wallace, director

Column type Capillary
Active phase DB-5 MS
Column length (m) 30.
Carrier gas Helium
Substrate
Column diameter (mm) 0.25
Phase thickness (μm) 0.25
Program 70 0C 5 0C/min -> 120 0C 10 0C/min -> 280 0C (20 min)
I 1570.
ReferencePurushothaman and Ravi, 2013
Comment MSDC-RI

References

Bilterys and Gisseleire, 1935
Bilterys, R.; Gisseleire, J.,
Investigations on the Congelation Temperature of Organic Compounds,
Bull. Soc. Chim. Belg., 1935, 44, 567. [all data]
Gartenmeister, 1886
Gartenmeister, R.,
Investigation of the physical characterstics of liquid compounds: vi boiling point and specific volume of normal fatty acid esters,
Justus Liebigs Ann. Chem., 1886, 233, 249-315. [all data]
Zincke, 1869
Zincke, T.,
Justus Liebigs Ann. Chem., 1869, 152, 1. [all data]