2,3,4,5-Tetramethylphenol

Phase change data

Data compiled by: Thermodynamics Research Center, NIST Boulder Laboratories, Chris Muzny director

Quantity Value Units Method Reference Comment
Tboil533.15KN/AKarr, Estep, et al., 1961Uncertainty assigned by TRC = 4. K
Tboil533.15KN/AKarr, 1957Uncertainty assigned by TRC = 4. K
Tboil539.15KN/ATohl, 1888Uncertainty assigned by TRC = 5. K
Quantity Value Units Method Reference Comment
Tfus359.65KN/AKarr, 1957Uncertainty assigned by TRC = 2. K
Tfus355.15KN/ABuu-Hoi, Lejeune, et al., 1955Uncertainty assigned by TRC = 2. K
Tfus356.15KN/ABamberger and Blangey, 1911Uncertainty assigned by TRC = 3. K
Tfus359.65KN/ATohl, 1888Uncertainty assigned by TRC = 3. K

In addition to the Thermodynamics Research Center (TRC) data available from this site, much more physical and chemical property data is available from the following TRC products:

References

Karr, Estep, et al., 1961
Karr, C.; Estep, P.A.; Chang, T.-C.L.; Comberiati, H.R., , U. S. Bur. Mines, Bull. 591, 1961. [all data]

Karr, 1957
Karr, C., , U. S. Bur. Mines, Inform. Circ. IC 7802, 1957. [all data]

Tohl, 1888
Tohl, A., Chem. Ber., 1888, 21, 904. [all data]

Buu-Hoi, Lejeune, et al., 1955
Buu-Hoi, Ng.Ph.; Lejeune, G.; Sy, M., C. R. Hebd. Seances Acad. Sci., 1955, 240, 2241. [all data]

Bamberger and Blangey, 1911
Bamberger; Blangey, Justus Liebigs Ann. Chem., 1911, 384, 272. [all data]