[1,1'-Bicyclopentyl]-2-ol
- Formula: C10H18O
- Molecular weight: 154.2493
- IUPAC Standard InChIKey: QMWSCHMOUMCING-UHFFFAOYSA-N
- CAS Registry Number: 4884-25-7
- Chemical structure:
View 3d structure (requires JavaScript / HTML 5) - Other names: [Bicyclopentyl]-2-ol; 2-Cyclopentylcyclopentanol

Phase change data

Data compiled by: Thermodynamics Research Center, NIST Boulder Laboratories, Chris Muzny director
Quantity | Value | Units | Method | Reference | Comment |
---|---|---|---|---|---|
Tboil | 506.15 | K | N/A | Boord, Greenlee, et al., 1949 | Uncertainty assigned by TRC = 2. K |

References

Boord, Greenlee, et al., 1949
Boord, C.E.; Greenlee, K.W.; Perilstein, W.L.; Derfer, J.M.,
The Synthesis, Purification and Prop. of Hydrocarbons of Low Mol. Wt., Am. Pet. Inst. Res. Proj. 45, Eleventh Annu. Rep., Ohio State Univ., 1949. [all data]