Bufotenine
- Formula: C12H16N2O
- Molecular weight: 204.2682
- IUPAC Standard InChIKey: VTTONGPRPXSUTJ-UHFFFAOYSA-N
- CAS Registry Number: 487-93-4
- Chemical structure:
View 3d structure (requires JavaScript / HTML 5) - Other names: 1H-Indol-5-ol, 3-[2-(dimethylamino)ethyl]-; Indol-5-ol, 3-[2-(dimethylamino)ethyl]-; Bufotenin; Cinobufotenine; Dimethylserotonin; Mappin; Mappine; N,N-Dimethyl-5-hydroxytryptamine; N,N-Dimethylserotonin; 3-[β-(Dimethylamino)ethyl]-5-hydroxyindole; 3-[2-(Dimethylamino)ethyl]-5-indolol; 3-[2-(Dimethylamino)ethyl]indol-5-ol; 5-Hydroxy-N,N-dimethyltryptamine; Cohoba; DM5-HT; NSC 89593; 3-[2-(Dimethylamino)ethyl]-1H-indol-5-ol

Van Den Dool and Kratz RI, non-polar column, temperature ramp

Column type | Active phase | I | Reference | Comment |
---|---|---|---|---|
Capillary | VF-5MS | 2123.2 | Tretyakov, 2014 | 30. m/0.25 mm/0.25 μm, He; Tstart: 60. C; Tend: 270. C |

Normal alkane RI, non-polar column, temperature ramp

Column type | Active phase | I | Reference | Comment |
---|---|---|---|---|
Packed | SE-30 | 2030. | Narasimhachari, Spaide, et al., 1971 | Column length: 2. m; Tstart: 140. C |

Normal alkane RI, non-polar column, custom temperature program

Column type | Active phase | I | Reference | Comment |
---|---|---|---|---|
Other | Methyl Silicone | 2030. | Ardrey and Moffat, 1981 | Program: not specified |

References

Tretyakov, 2014
Tretyakov, K.V.,
Retention Data. NIST Mass Spectrometry Data Center., NIST Mass Spectrometry Data Center, 2014. [all data]
Narasimhachari, Spaide, et al., 1971
Narasimhachari, N.; Spaide, J.; Heller, B.,
Gas liquid chromatographic and mass spectrometric studies on trimethylsilyl derivatives of N-methyl- and N,N-dimethyltryptamines,
J. Chromatogr. Sci., 1971, 9, 8, 502-505, https://doi.org/10.1093/chromsci/9.8.502
. [all data]
Ardrey and Moffat, 1981
Ardrey, R.E.; Moffat, A.C.,
Gas-liquid chromatographic retention indices of 1318 substances of toxicological interest on SE-30 or OV-1 stationary phase,
J. Chromatogr., 1981, 220, 3, 195-252, https://doi.org/10.1016/S0021-9673(00)81925-1
. [all data]