9H-Fluoren-9-one
- Formula: C13H8O
- Molecular weight: 180.2020
- IUPAC Standard InChIKey: YLQWCDOCJODRMT-UHFFFAOYSA-N
- CAS Registry Number: 486-25-9
- Chemical structure:
View 3d structure (requires JavaScript / HTML 5) - Other names: Fluoren-9-one; Fluorenone; 9-Fluorenone; 9H-Fluorene-9-one

Gas phase thermochemistry data

Data compiled by: Hussein Y. Afeefy, Joel F. Liebman, and Stephen E. Stein
Quantity | Value | Units | Method | Reference | Comment |
---|---|---|---|---|---|
ΔfH°gas | 52.3 ± 2.3 | kJ/mol | Ccb | Sabbah, El Watik, et al., 1988 |

Condensed phase thermochemistry data

Data compiled by: Hussein Y. Afeefy, Joel F. Liebman, and Stephen E. Stein
Quantity | Value | Units | Method | Reference | Comment |
---|---|---|---|---|---|
ΔfH°solid | -36.1 ± 2.3 | kJ/mol | Ccb | Sabbah, El Watik, et al., 1988 | |
Quantity | Value | Units | Method | Reference | Comment |
ΔcH°solid | -6222.8 ± 2.1 | kJ/mol | Ccb | Sabbah, El Watik, et al., 1988 | Corresponding ΔfHºsolid = -36.2 kJ/mol (simple calculation by NIST; no Washburn corrections) |

Phase change data

Data compiled as indicated in comments:
BS - Robert L. Brown and Stephen E. Stein
TRC - Thermodynamics Research Center, NIST Boulder Laboratories, Chris Muzny director
AC - William E. Acree, Jr., James S. Chickos
ALS - Hussein Y. Afeefy, Joel F. Liebman, and Stephen E. Stein
DRB - Donald R. Burgess, Jr.
Quantity | Value | Units | Method | Reference | Comment |
---|---|---|---|---|---|
Tboil | 614.7 | K | N/A | Weast and Grasselli, 1989 | BS |
Quantity | Value | Units | Method | Reference | Comment |
Tfus | 357.15 | K | N/A | Pitt and Smyth, 1959 | Uncertainty assigned by TRC = 2. K; TRC |
Tfus | 355. | K | N/A | Hauser, Brasen, et al., 1956 | Uncertainty assigned by TRC = 4. K; TRC |
Quantity | Value | Units | Method | Reference | Comment |
ΔsubH° | 93.9 ± 1.8 | kJ/mol | GS | Verevkin, 1998 | AC |
ΔsubH° | 88.4 ± 0.4 | kJ/mol | C | Sabbah, El Watik, et al., 1988 | ALS |
ΔsubH° | 88.4 | kJ/mol | N/A | Sabbah, El Watik, et al., 1988 | DRB |
ΔsubH° | 88.4 ± 0.4 | kJ/mol | C | Sabbah, Watik, et al., 1988 | AC |
Enthalpy of vaporization
ΔvapH (kJ/mol) | Temperature (K) | Reference | Comment |
---|---|---|---|
60.9 | 435. | Sivaraman, Martin, et al., 1983 | AC |
59.8 | 475. | Sivaraman, Martin, et al., 1983 | AC |
59.1 | 525. | Sivaraman, Martin, et al., 1983 | AC |
58.6 | 565. | Sivaraman, Martin, et al., 1983 | AC |
57.9 | 595. | Sivaraman, Martin, et al., 1983 | AC |
Enthalpy of sublimation
ΔsubH (kJ/mol) | Temperature (K) | Method | Reference | Comment |
---|---|---|---|---|
87.6 ± 0.3 | 319. | C | Sabbah, Watik, et al., 1988 | AC |
Enthalpy of fusion
ΔfusH (kJ/mol) | Temperature (K) | Method | Reference | Comment |
---|---|---|---|---|
14.85 | 353.3 | DSC | Verevkin, 1998 | AC |
18.12 | 356.4 | N/A | Acree, 1991 | AC |

Kovats' RI, non-polar column, custom temperature program

View large format table.

Column type Active phase I Reference Comment
PackedSE-301705.Ramsey, Lee, et al., 1980He, Chromosorb G HP (80-100 mesh); Column length: 1.5 m; Program: not specified

Van Den Dool and Kratz RI, non-polar column, temperature ramp

View large format table.

Column type Active phase I Reference Comment
CapillaryDB-51752.Rostad and Pereira, 198630. m/0.26 mm/0.25 μm, He, 50. C @ 4. min, 6. K/min, 300. C @ 20. min

Van Den Dool and Kratz RI, polar column, temperature ramp

View large format table.

Column type Active phase I Reference Comment
CapillarySupelcowax-102697.Chung, Yung, et al., 200160. m/0.25 mm/0.25 μm, He, 35. C @ 5. min, 2. K/min, 195. C @ 90. min

Normal alkane RI, non-polar column, temperature ramp

View large format table.

Column type Active phase I Reference Comment
CapillaryUltra-11663.Okumura, 199125. m/0.32 mm/0.25 μm, He, 3. K/min; Tstart: 80. C; Tend: 260. C

Normal alkane RI, non-polar column, custom temperature program

View large format table.

Column type Active phase I Reference Comment
CapillaryHP-51746.Ansorena, Astiasarán, et al., 200030. m/0.25 mm/0.25 μm, He; Program: 40C (10min) => 3C/min => 120C => 10C/min => 250C (5min)
CapillaryMethyl Silicone1693.Oda, Yasuhara, et al., 199825. m/0.25 mm/0.25 μm, He; Program: 50 0C (2 min) 20 0C/min -> 160 0C 5 0C/min -> 210 0C 10 0C/min -> 300 0C
CapillaryMethyl Silicone1702.Oda, Yasuhara, et al., 199825. m/0.25 mm/0.25 μm, He; Program: 50 0C (2 min) 20 0C/min -> 160 0C 5 0C/min -> 210 0C 10 0C/min -> 300 0C
CapillaryPolydimethyl siloxane, unknown content of Ph-groups1752.Geldon, 1989Program: not specified
CapillaryPolydimethyl siloxane, unknown content of Ph-groups1752.Geldon, 1989Program: not specified
CapillaryOV-1, SE-30, Methyl silicone, SP-2100, OV-101, DB-1, etc.1705.Waggott and Davies, 1984Hydrogen; Column length: 50. m; Column diameter: 0.32 mm; Program: not specified
OtherMethyl Silicone1705.Ardrey and Moffat, 1981Program: not specified

Lee's RI, non-polar column, temperature ramp

View large format table.

Column type Active phase I Reference Comment
CapillaryHP-5294.3Shao, Wang, et al., 200630. m/0.3 mm/0.25 μm, He, 50. C @ 5. min, 5. K/min, 200. C @ 15. min
CapillaryHP-5294.03Pedersen, Durant, et al., 200530. m/0.25 mm/0.25 μm, Helium, 50. C @ 1.5 min, 6. K/min, 310. C @ 10. min
CapillaryDB-5MS293.64Chen, Keeran, et al., 200230. m/0.25 mm/0.5 μm, 40. C @ 1. min, 10. K/min; Tend: 310. C
CapillarySPB-5293.7Knobloch and Engewald, 199340. C @ 2. min, 4. K/min; Column length: 30. m; Column diameter: 0.25 mm; Tend: 300. C
CapillarySPB-5294.3Knobloch and Engewald, 199340. C @ 2. min, 4. K/min; Column length: 30. m; Column diameter: 0.25 mm; Tend: 300. C
CapillarySE-52294.49Boenke and Ballschmiter, 1987Hydrogen, 3. K/min; Column length: 12. m; Tstart: 120. C; Tend: 285. C
CapillaryDB-5293.88Rostad and Pereira, 198630. m/0.26 mm/0.25 μm, He, 50. C @ 4. min, 6. K/min, 300. C @ 20. min
CapillarySE-30293.09König, Balfanz, et al., 198330. m/0.32 mm/0.25 μm, He, 2. K/min; Tstart: 120. C; Tend: 280. C
CapillarySE-52294.79Lee, Vassilaros, et al., 197912. m/0.3 mm/0.34 μm, He, 2. K/min; Tstart: 50. C; Tend: 250. C

Lee's RI, non-polar column, custom temperature program

View large format table.

Column type Active phase I Reference Comment
CapillaryDB-5294.5Fuentes, Font, et al., 2007Column length: 60. m; Program: not specified
CapillaryDB-5MS293.7Aracil, Font, et al., 2005Column length: 60. m; Column diameter: 0.25 mm; Program: not specified
CapillaryLM-5290.24Ré-Poppi and Santiago-Silva, 200530. m/0.25 mm/0.25 μm, He; Program: 60C(2min) => 15C/min => 180C => 5C/min => 280C (10min)
CapillaryDB-5292.6Lundstedt, Haglund, et al., 200330. m/0.25 mm/0.25 μm; Program: not specified
CapillaryLM-5291.28Ré-Poppi and Santiago-Silva, 200230. m/0.25 mm/0.25 μm, He; Program: 60C(2min) => 15C/min => 180C => 5C/min => 280C(5min)
CapillaryBP-5293.6Kelly, Bartle, et al., 1992Column length: 25. m; Column diameter: 0.32 mm; Program: XX C X C/min -> 170 C 40 C/min -> 300 C (5 min); Check the values XX and X (bad xerox copy)
CapillaryDB-5294.13Naikwadi, Charbonneau, et al., 1987Column length: 30. m; Column diameter: 0.32 mm; Program: not specified
CapillaryDB-5294.79Naikwadi, Charbonneau, et al., 1987Column length: 30. m; Column diameter: 0.32 mm; Program: not specified
CapillaryOV-101293.6Tucminen, Wickstrom, et al., 1986Program: not specified

Gas phase ion energetics data

Data compiled by: Sharon G. Lias, Rhoda D. Levin, and Sherif A. Kafafi

Ionization energy determinations

IE (eV) Method Reference
8.29PECentineo, Fragala, et al., 1978
8.36 ± 0.03PIPotapov, Kardash, et al., 1972
8.36 ± 0.02PIPotapov and Sorokin, 1971

References

Sabbah, El Watik, et al., 1988
Sabbah, R.; El Watik, L.; Minadakis, C.,
Thermodynamic study of 9-fluorenone,
C. R. Acad. Sci. Paris, 1988, 307, 239-244. [all data]
Weast and Grasselli, 1989
CRC Handbook of Data on Organic Compounds, 2nd Editon, Weast,R.C and Grasselli, J.G., ed(s)., CRC Press, Inc., Boca Raton, FL, 1989, 1. [all data]
Pitt and Smyth, 1959
Pitt, D.A.; Smyth, C.P.,
Microwave Absorption and Molecular Structure in Liquids XXVII. The Mutual Viscosities and Dielectric Relaxtion Times of Several Polar Aromatic Compounds in Solution,
J. Am. Chem. Soc., 1959, 81, 783. [all data]
Hauser, Brasen, et al., 1956
Hauser, C.R.; Brasen, W.R.; Skell, P.S.; Kantor, S.W.; Brodhag, A.E.,
Dimeric Oleifins versus AMins from α-Aryl Alkyl Halides with Alkali Dehydrohalogenation. Imines from Amines,
J. Am. Chem. Soc., 1956, 78, 1653-8. [all data]
Verevkin, 1998
Verevkin, S.P.,
Thermochemistry of aromatic ketones. Experimental enthalpies of formation and structural effects,
Thermochim. Acta, 1998, 310, 229-235. [all data]
Sabbah, Watik, et al., 1988
Sabbah, R.; Watik, L.E.; Minadakis, C.,
Thermodynamic study of 9-fluorenone,
C. R. Acad. Sci. Paris, Ser. III, 1988, 307, 3, 239. [all data]
Sivaraman, Martin, et al., 1983
Sivaraman, A.; Martin, R.J.; Kobayashi, Riki,
A versatile apparatus to study the vapor pressures and heats of vaporization of carbazole, 9-fluorenone and 9-hydroxyfluorene at elevated temperatures,
Fluid Phase Equilibria, 1983, 12, 1-2, 175-188, https://doi.org/10.1016/0378-3812(83)85019-5
. [all data]
Acree, 1991
Acree, William E.,
Thermodynamic properties of organic compounds: enthalpy of fusion and melting point temperature compilation,
Thermochimica Acta, 1991, 189, 1, 37-56, https://doi.org/10.1016/0040-6031(91)87098-H
. [all data]