Pyrazine, 2,3-dichloro-
- Formula: C4H2Cl2N2
- Molecular weight: 148.978
- IUPAC Standard InChIKey: MLCNOCRGSBCAGH-UHFFFAOYSA-N
- CAS Registry Number: 4858-85-9
- Chemical structure:
View 3d structure (requires JavaScript / HTML 5) - Other names: 2,3-Dichloropyrazine

Normal alkane RI, non-polar column, temperature ramp

Column type | Active phase | I | Reference | Comment |
---|---|---|---|---|
Capillary | OV-101 | 1032. | Mihara and Masuda, 1987 | N2, 2. K/min; Column length: 50. m; Column diameter: 0.22 mm; Tstart: 80. C; Tend: 200. C |

Normal alkane RI, polar column, custom temperature program

Column type | Active phase | I | Reference | Comment |
---|---|---|---|---|
Capillary | Carbowax 20M | 1581. | Mihara and Masuda, 1987 | Program: not specified |

References

Halverson and Hirt, 1951
Halverson, F.; Hirt, R.C.,
J. Chem. Phys., 1951, 19, 711. [all data]
Mihara and Masuda, 1987
Mihara, S.; Masuda, H.,
Correlation between molecular structures and retention indices of pyrazines,
J. Chromatogr., 1987, 402, 309-317, https://doi.org/10.1016/0021-9673(87)80029-8
. [all data]