2-(ethylsulfonyl)propane
- Formula: C5H12O2S
- Molecular weight: 136.213
- IUPAC Standard InChIKey: RDKKQZIFDSEMNU-UHFFFAOYSA-N
- CAS Registry Number: 4853-75-2
- Chemical structure:
View 3d structure (requires JavaScript / HTML 5) - Permanent link for this species. Use this link for bookmarking this species for future reference.

Phase change data

Data compiled by: Thermodynamics Research Center, NIST Boulder Laboratories, Chris Muzny director
Quantity | Value | Units | Method | Reference | Comment |
---|---|---|---|---|---|
Tfus | 268. | K | N/A | Mcallan, Cullum, et al., 1951 | Uncertainty assigned by TRC = 3. K |

References

Mcallan, Cullum, et al., 1951
Mcallan, D.T.; Cullum, T.V.; Dean, R.A.; Fidler, F.A.,
The Preparation and Properties of Sulfur Compounds Related to Petroleum I. The Dialkyl Sulfides and Disulfides,
J. Am. Chem. Soc., 1951, 73, 3627-32. [all data]