2-(Methylsulphonyl)propane
- Formula: C4H10O2S
- Molecular weight: 122.186
- IUPAC Standard InChIKey: VTWYQAQIXXAXOR-UHFFFAOYSA-N
- CAS Registry Number: 4853-74-1
- Chemical structure:
View 3d structure (requires JavaScript / HTML 5) - Other names: Isopropyl methyl sulphone

Gas phase thermochemistry data

Data compiled by: Hussein Y. Afeefy, Joel F. Liebman, and Stephen E. Stein
Quantity | Value | Units | Method | Reference | Comment |
---|---|---|---|---|---|
ΔfH°gas | -433. ± 3. | kJ/mol | Ccr | Busfield, Mackle, et al., 1961 | Heat of combustion corrected for constant pressure |

Condensed phase thermochemistry data

Data compiled by: Hussein Y. Afeefy, Joel F. Liebman, and Stephen E. Stein
Quantity | Value | Units | Method | Reference | Comment |
---|---|---|---|---|---|
ΔfH°liquid | -503.8 ± 1.3 | kJ/mol | Ccr | Busfield, Mackle, et al., 1961 | Heat of combustion corrected for constant pressure |
Quantity | Value | Units | Method | Reference | Comment |
ΔcH°liquid | -3101.3 ± 0.63 | kJ/mol | Ccr | Busfield, Mackle, et al., 1961 | Heat of combustion corrected for constant pressure |

Phase change data

Data compiled as indicated in comments:
TRC - Thermodynamics Research Center, NIST Boulder Laboratories, Chris Muzny director
ALS - Hussein Y. Afeefy, Joel F. Liebman, and Stephen E. Stein
Quantity | Value | Units | Method | Reference | Comment |
---|---|---|---|---|---|
Tfus | 289. | K | N/A | Mcallan, Cullum, et al., 1951 | Uncertainty assigned by TRC = 3. K; TRC |
Quantity | Value | Units | Method | Reference | Comment |
ΔvapH° | 70. ± 3. | kJ/mol | E | Busfield, Mackle, et al., 1961 | Heat of combustion corrected for constant pressure; ALS |

References

Busfield, Mackle, et al., 1961
Busfield, W.K.; Mackle, H.; O'Hare, P.A.G.,
Studies in the thermochemistry of sulphones. Part 2 - The standard heats of formation of sulphones of the type RSO2CH3,
Trans. Faraday Soc., 1961, 57, 1054-1057. [all data]
Mcallan, Cullum, et al., 1951
Mcallan, D.T.; Cullum, T.V.; Dean, R.A.; Fidler, F.A.,
The Preparation and Properties of Sulfur Compounds Related to Petroleum I. The Dialkyl Sulfides and Disulfides,
J. Am. Chem. Soc., 1951, 73, 3627-32. [all data]