1-Butanamine, N-butylidene-
- Formula: C8H17N
- Molecular weight: 127.2273
- IUPAC Standard InChIKey: GMYLJUMIAPOWOO-UHFFFAOYSA-N
- CAS Registry Number: 4853-56-9
- Chemical structure:
View 3d structure (requires JavaScript / HTML 5) - Other names: Butylamine, N-butylidene-; N-Butylidene-1-butanamine; N-Butylidenebutylamine

Reaction thermochemistry data

Data compiled by: Hussein Y. Afeefy, Joel F. Liebman, and Stephen E. Stein
Individual Reactions
By formula: H2 + C8H17N = C8H19N
Quantity | Value | Units | Method | Reference | Comment |
---|---|---|---|---|---|
ΔrH° | 86.2 ± 2.6 | kJ/mol | Chyd | Hafelinger and Steinmann, 1977 | liquid phase; solvent: Acetic acid |

References

Hafelinger and Steinmann, 1977
Hafelinger, G.; Steinmann, L.,
Heat of hydrogenation of compounds containing isolated and conjugted C=N bouble bonds,
Angew. Chem. Int. Ed. Engl., 1977, 16, 47-48. [all data]
Lang (editor), 1961
Lang (editor), L.,
Absorption Spectra in the Ultraviolet and Visible Region, 1961, 2, 75. [all data]