Cyclopentane, 1,2,4-trimethyl-, (1α,2α,4β)-
- Formula: C8H16
- Molecular weight: 112.2126
- IUPAC Standard InChIKey: PNUFYSGVPVMNRN-WHUPJOBBSA-N
- CAS Registry Number: 4850-28-6
- Chemical structure:
View 3d structure (requires JavaScript / HTML 5) - Stereoisomers:
- Other names: Cyclopentane, 1,2,4-trimethyl-, cis-1,cis-2,trans-4-; 1,cis-2,trans-4-Trimethylcyclopentane; 1,2,4-Trimethylcyclopentane, cis, trans; 1α,2α4β-Trimethylcyclopentane; 1-cis-2-cis-4-trans-Trimethylcyclopentane; Cyclopentane, 1,2,4-trimethyl-, cis,trans; (1α,2α,4β)-1,2,4-trimethylcyclopentane; cis 1,2-trans-4-trimethylcyclopentane

Phase change data

Data compiled as indicated in comments:
TRC - Thermodynamics Research Center, NIST Boulder Laboratories, Chris Muzny director
AC - William E. Acree, Jr., James S. Chickos
Quantity | Value | Units | Method | Reference | Comment |
---|---|---|---|---|---|
Tboil | 390.0 ± 0.2 | K | AVG | N/A | Average of 7 values; Individual data points |
Quantity | Value | Units | Method | Reference | Comment |
Tfus | 139. ± 10. | K | AVG | N/A | Average of 7 values; Individual data points |
Enthalpy of vaporization
ΔvapH (kJ/mol) | Temperature (K) | Method | Reference | Comment |
---|---|---|---|---|
36.8 | 326. | A,MM | Stephenson and Malanowski, 1987 | Based on data from 311. to 392. K. See also Forziati, Norris, et al., 1949.; AC |

Kovats' RI, non-polar column, isothermal

Column type | Active phase | Temperature (C) | I | Reference | Comment |
---|---|---|---|---|---|
Capillary | CP Sil 2 | 60. | 784.4 | Estel, Mohnke, et al., 1995 | 100. m/0.25 mm/0.25 μm |
Capillary | OV-101 | 40. | 769. | Laub and Purnell, 1988 | |
Capillary | OV-101 | 60. | 774. | Laub and Purnell, 1988 | |
Capillary | OV-101 | 80. | 779. | Laub and Purnell, 1988 | |
Capillary | Squalane | 50. | 772.7 | Lunskii and Paizanskaya, 1988 | He; Column length: 50. m; Column diameter: 0.22 mm |
Capillary | Squalane | 70. | 777. | Lunskii and Paizanskaya, 1988 | He; Column length: 50. m; Column diameter: 0.22 mm |
Capillary | Squalane | 50. | 773.0 | Krupcik, Cellar, et al., 1986 | Column length: 180. m; Column diameter: 0.25 mm |
Capillary | Squalane | 50. | 774.8 | Krupcik, Cellar, et al., 1986 | Column length: 180. m; Column diameter: 0.25 mm |
Capillary | OV-101 | 30. | 766. | Chien, Furio, et al., 1983 | |
Capillary | OV-101 | 40. | 769. | Chien, Furio, et al., 1983 | |
Capillary | OV-101 | 50. | 771. | Chien, Furio, et al., 1983 | |
Capillary | OV-101 | 60. | 774. | Chien, Furio, et al., 1983 | |
Capillary | OV-101 | 70. | 776. | Chien, Furio, et al., 1983 | |
Capillary | OV-101 | 80. | 779. | Chien, Furio, et al., 1983 | |
Capillary | DB-1 | 60. | 775. | Lubeck and Sutton, 1983 | Column length: 60. m; Column diameter: 0.264 mm |
Capillary | DB-1 | 60. | 775.4 | Lubeck and Sutton, 1983 | 60. m/0.259 mm/1. μm |
Capillary | OV-101 | 50. | 740. | Johansen and Ettre, 1982 | 100. m/0.27 mm/0.20 μm |
Capillary | OV-101 | 50. | 740. | Johansen and Ettre, 1982 | 55. m/0.27 mm/0.9 μm |
Capillary | SF-96 | 50. | 740. | Johansen and Ettre, 1982 | 91.4 m/0.31 mm/0.20 μm |
Capillary | Squalane | 100. | 737. | Lulova, Leont'eva, et al., 1976 | He; Column length: 120. m; Column diameter: 0.25 mm |
Capillary | Squalane | 100. | 778.8 | Lulova, Leont'eva, et al., 1976 | He; Column length: 120. m; Column diameter: 0.25 mm |
Capillary | Squalane | 100. | 778.8 | Lulova, Leont'eva, et al., 1976 | He; Column length: 120. m; Column diameter: 0.25 mm |
Capillary | Squalane | 50. | 773. | Rijks and Cramers, 1974 | N2; Column length: 100. m; Column diameter: 0.25 mm |
Capillary | Squalane | 70. | 777. | Rijks and Cramers, 1974 | N2; Column length: 100. m; Column diameter: 0.25 mm |
Capillary | Vacuum Grease Oil (VM-4) | 35. | 771. | Sidorov, Petrova, et al., 1972 | |
Capillary | Vacuum Grease Oil (VM-4) | 45. | 774. | Sidorov, Petrova, et al., 1972 | |
Capillary | Vacuum Grease Oil (VM-4) | 50. | 775. | Sidorov, Petrova, et al., 1972 | |
Capillary | Vacuum Grease Oil (VM-4) | 58. | 777. | Sidorov, Petrova, et al., 1972 | |
Capillary | Vacuum Grease Oil (VM-4) | 68. | 779. | Sidorov, Petrova, et al., 1972 | |
Capillary | Squalane | 70. | 773.6 | Dimov and Schopov, 1971 | Column length: 100. m; Column diameter: 0.25 mm |
Packed | Vacuum Grease Oil (VM-4) | 35. | 771. | Sidorov, Ivanova, et al., 1971 | |
Packed | SE-30 | 130. | 791. | Mitra and Saha, 1970 | N2, Chromosorb W; Column length: 6.1 m |
Packed | Squalane | 27. | 768. | Hively and Hinton, 1968 | He, Chromosorb P; Column length: 15. m; Column diameter: 0.25 mm |
Packed | Squalane | 49. | 774. | Hively and Hinton, 1968 | He, Chromosorb P; Column length: 15. m; Column diameter: 0.25 mm |
Packed | Squalane | 67. | 777. | Hively and Hinton, 1968 | He, Chromosorb P; Column length: 15. m; Column diameter: 0.25 mm |
Packed | Squalane | 86. | 782. | Hively and Hinton, 1968 | He, Chromosorb P; Column length: 15. m; Column diameter: 0.25 mm |

Kovats' RI, non-polar column, temperature ramp

Column type | Active phase | I | Reference | Comment |
---|---|---|---|---|
Capillary | Apiezon L | 783. | Louis, 1971 | N2, 1. K/min; Column length: 50. m; Column diameter: 0.25 mm; Tstart: 60. C |
Capillary | Apiezon L | 744. | Louis, 1971 | N2, 1. K/min; Column length: 50. m; Column diameter: 0.25 mm; Tstart: 60. C |

Kovats' RI, non-polar column, custom temperature program

Column type | Active phase | I | Reference | Comment |
---|---|---|---|---|
Capillary | Petrocol DH-100 | 737. | Haagen-Smit Laboratory, 1997 | He; Column length: 100. m; Column diameter: 0.2 mm; Program: 5C(10min) => 5C/min => 50C(48min) => 1.5C/min => 195C(91min) |

Van Den Dool and Kratz RI, non-polar column, temperature ramp

Column type | Active phase | I | Reference | Comment |
---|---|---|---|---|
Capillary | Petrocol DH | 776.6 | Censullo, Jones, et al., 2003 | 50. m/0.25 mm/0.5 μm, He, 35. C @ 10. min, 3. K/min, 200. C @ 10. min |
Capillary | OV-101 | 764.1 | Yin, Liu, et al., 2001 | N2, 1. K/min; Column length: 80. m; Column diameter: 0.22 mm; Tstart: 30. C; Tend: 130. C |
Capillary | Ultra-1 | 737. | Olson, Sinkevitch, et al., 1992 | 4. K/min; Tstart: -40. C; Tend: 230. C |
Capillary | Petrocol DH | 768.44 | White, Douglas, et al., 1992 | 100. m/0.25 mm/0.5 μm, He, 1. K/min; Tstart: 30. C; Tend: 220. C |
Capillary | Petrocol DH | 768.82 | White, Douglas, et al., 1992 | 100. m/0.25 mm/0.5 μm, He, 1. K/min; Tstart: 30. C; Tend: 220. C |
Capillary | Petrocol DH | 769. | White, Hackett, et al., 1992 | 100. m/0.25 mm/0.5 μm, He, 1. K/min; Tstart: 30. C; Tend: 220. C |

Normal alkane RI, non-polar column, isothermal

Column type | Active phase | Temperature (C) | I | Reference | Comment |
---|---|---|---|---|---|
Capillary | Squalane | 100. | 784. | Krupcik, Cellar, et al., 1986, 2 | Column length: 180. m; Column diameter: 0.25 mm |
Capillary | Squalane | 40. | 770. | Krupcik, Cellar, et al., 1986, 2 | Column length: 180. m; Column diameter: 0.25 mm |
Capillary | Squalane | 70. | 777. | Krupcik, Cellar, et al., 1986, 2 | Column length: 180. m; Column diameter: 0.25 mm |
Capillary | Squalane | 86. | 776. | Vigdergauz and Martynov, 1971 | He; Column length: 150. m; Column diameter: 0.35 mm |

Normal alkane RI, non-polar column, temperature ramp

Column type | Active phase | I | Reference | Comment |
---|---|---|---|---|
Capillary | Petrocol DH | 744. | Supelco, 2012 | 100. m/0.25 mm/0.50 μm, Helium, 20. C @ 15. min, 15. K/min, 220. C @ 30. min |
Capillary | Squalane | 773. | Krupcik, Cellar, et al., 1986, 2 | 0.2 K/min; Column length: 180. m; Column diameter: 0.25 mm; Tstart: 40. C |
Capillary | Squalane | 774. | Krupcik, Cellar, et al., 1986, 2 | 0.4 K/min; Column length: 180. m; Column diameter: 0.25 mm; Tstart: 40. C |
Capillary | Squalane | 778. | Krupcik, Cellar, et al., 1986, 2 | 0.6 K/min; Column length: 180. m; Column diameter: 0.25 mm; Tstart: 40. C |
Capillary | Squalane | 780. | Krupcik, Cellar, et al., 1986, 2 | 0.8 K/min; Column length: 180. m; Column diameter: 0.25 mm; Tstart: 40. C |
Capillary | Squalane | 780. | Krupcik, Cellar, et al., 1986, 2 | 1.0 K/min; Column length: 180. m; Column diameter: 0.25 mm; Tstart: 40. C |

References

Stephenson and Malanowski, 1987
Stephenson, Richard M.; Malanowski, Stanislaw,
Handbook of the Thermodynamics of Organic Compounds, 1987, https://doi.org/10.1007/978-94-009-3173-2
. [all data]
Forziati, Norris, et al., 1949
Forziati, Alphonse F.; Norris, William R.; Rossini, Frederick D.,
Vapor pressures and boiling points of sixty API-NBS hydrocarbons,
J. RES. NATL. BUR. STAN., 1949, 43, 6, 555-17, https://doi.org/10.6028/jres.043.050
. [all data]