1,12-Dodecanediamine
- Formula: C12H28N2
- Molecular weight: 200.3641
- CAS Registry Number: 4843-89-4

Phase change data

Data compiled by: William E. Acree, Jr., James S. Chickos
Enthalpy of vaporization
ΔvapH (kJ/mol) | Temperature (K) | Method | Reference | Comment |
---|---|---|---|---|
110.1 | 328. | A | Stephenson and Malanowski, 1987 | Based on data from 313. to 353. K. |
Enthalpy of fusion
ΔfusH (kJ/mol) | Temperature (K) | Method | Reference |
---|---|---|---|
67.1 | 341.8 | DSC | Khimeche and Dahmani, 2006 |
67.1 | 340.5 | DSC | Dall'Acqua, Della Gatta, et al., 2002 |

References

Stephenson and Malanowski, 1987
Stephenson, Richard M.; Malanowski, Stanislaw,
Handbook of the Thermodynamics of Organic Compounds, 1987, https://doi.org/10.1007/978-94-009-3173-2
. [all data]
Khimeche and Dahmani, 2006
Khimeche, Kamel; Dahmani, Abdallah,
Solid-Liquid Equilibria of Naphthalene + Alkanediamine Mixtures,
J. Chem. Eng. Data, 2006, 51, 2, 382-385, https://doi.org/10.1021/je0502851
. [all data]
Dall'Acqua, Della Gatta, et al., 2002
Dall'Acqua, Lorenzo; Della Gatta, Giuseppe; Nowicka, Bozenna; Ferloni, Paolo,
Enthalpies and entropies of fusion of ten alkane-α, ω-diamines H2 N-- (CH 2)n-- NH2 where 3≤n≤12,
The Journal of Chemical Thermodynamics, 2002, 34, 1, 1-12, https://doi.org/10.1006/jcht.2001.0950
. [all data]