Silvex, methyl ester
- Formula: C10H9Cl3O3
- Molecular weight: 283.536
- IUPAC Standard InChIKey: YTAXYXOJOYIQQO-UHFFFAOYSA-N
- CAS Registry Number: 4841-20-7
- Chemical structure:
View 3d structure (requires JavaScript / HTML 5) - Other names: Propanoic acid, 2-(2,4,5-trichlorophenoxy)-, methyl ester; Propionic acid, 2-(2,4,5-trichlorophenoxy)-, methyl ester; Methyl 2-(2,4,5-trichlorophenoxy)propionate; 2-(2,4,5-Trichlorophenoxy)propionic acid methyl ester; 2,4,5-TP, methyl ester; Fenoprop, methyl ester; Silvex, methylated

Phase change data

Data compiled by: Thermodynamics Research Center, NIST Boulder Laboratories, Chris Muzny director
Quantity | Value | Units | Method | Reference | Comment |
---|---|---|---|---|---|
Tfus | 361.16 | K | N/A | Donnelly, Drewes, et al., 1990 | Uncertainty assigned by TRC = 0.2 K |

Kovats' RI, non-polar column, isothermal

Column type | Active phase | Temperature (C) | I | Reference | Comment |
---|---|---|---|---|---|
Capillary | OV-1 | 160. | 1705. | Erdmann, Rochholz, et al., 1992 | |
Capillary | OV-1 | 190. | 1733. | Erdmann, Rochholz, et al., 1992 | |
Packed | DC-200 | 165. | 1712. | de Beer, van Peteghem, et al., 1978 | |
Packed | DC-200 | 165. | 1716. | de Beer, van Peteghem, et al., 1978 |

Kovats' RI, polar column, isothermal

Column type | Active phase | Temperature (C) | I | Reference | Comment |
---|---|---|---|---|---|
Packed | FFAP | 165. | 2371. | de Beer, van Peteghem, et al., 1978 | Column length: 1.8 m |
Packed | FFAP | 165. | 2372. | de Beer, van Peteghem, et al., 1978 | Column length: 1.8 m |

Normal alkane RI, non-polar column, temperature ramp

Column type | Active phase | I | Reference | Comment |
---|---|---|---|---|
Capillary | Ultra-1 | 1709. | Okumura, 1991 | 25. m/0.32 mm/0.25 μm, He, 3. K/min; Tstart: 80. C; Tend: 260. C |

References

Donnelly, Drewes, et al., 1990
Donnelly, J.R.; Drewes, L.A.; Johnson, R.L.; Munslow, W.D.; Knapp, K.K.; Sovocool, G.W.,
Purity and heat of fusion data for environmental standards as determined by differential scanning calorimetry,
Thermochim. Acta, 1990, 167, 2, 155, https://doi.org/10.1016/0040-6031(90)80476-F
. [all data]
Erdmann, Rochholz, et al., 1992
Erdmann, F.; Rochholz, G.; Schütz, H.,
Retention-indices on OV-1 of approximately 170 commonly used pesticides,
Mikrochim. Acta, 1992, 106, 3-6, 219-226, https://doi.org/10.1007/BF01242093
. [all data]
de Beer, van Peteghem, et al., 1978
de Beer, J.; van Peteghem, C.; Heyndrickx, A.,
Comparative Study of the Gas-Liquid Chromatographic Behaviour of the Pentafluorobenzyl Esters and the Methyl Esters of Ten Chlorophenoxyalkyl Acids,
J. Chromatogr., 1978, 157, 97-110, https://doi.org/10.1016/S0021-9673(00)92325-2
. [all data]
Okumura, 1991
Okumura, T.,
retention indices of environmental chemicals on methyl silicone capillary column,
Journal of Environmental Chemistry (Japan), 1991, 1, 2, 333-358, https://doi.org/10.5985/jec.1.333
. [all data]