Neocuproine
- Formula: C14H12N2
- Molecular weight: 208.2585
- IUPAC Standard InChIKey: IYRGXJIJGHOCFS-UHFFFAOYSA-N
- CAS Registry Number: 484-11-7
- Chemical structure:
View 3d structure (requires JavaScript / HTML 5) - Other names: 1,10-Phenanthroline, 2,9-dimethyl-; Neo-Cuproin; 2,9-Dimethyl-o-phenanthroline; 2,9-Dimethyl-1,10-phenanthroline; 2,9-Dimethylphenanthroline

Phase change data

Data compiled by: William E. Acree, Jr., James S. Chickos
Enthalpy of fusion
ΔfusH (kcal/mol) | Temperature (K) | Reference |
---|---|---|
4.21 | 435.9 | Bonicelli, Catalani, et al., 2007 |

References

Bonicelli, Catalani, et al., 2007
Bonicelli, M.G.; Catalani, A.; Mariano, G.; Vecchio, S.,
Heat capacities and molar enthalpies and entropies of fusion for anhydrous 1,10-phenanthroline and 2,9-dimethyl-1,10-phenanthroline,
Thermochimica Acta, 2007, 466, 1-2, 69-71, https://doi.org/10.1016/j.tca.2007.10.001
. [all data]