Naphthalene, 1,6-dimethyl-4-(1-methylethyl)-
- Formula: C15H18
- Molecular weight: 198.3034
- IUPAC Standard InChIKey: VMOJIHDTVZTGDO-UHFFFAOYSA-N
- CAS Registry Number: 483-78-3
- Chemical structure:
View 3d structure (requires JavaScript / HTML 5) - Other names: Naphthalene, 4-isopropyl-1,6-dimethyl-; Cadalene; Cadalin; 4-Isopropyl-1,6-dimethylnaphthalene; 1,6-dimethyl-4-(1-methylethyl) naphthalene; 1,6-Dimethyl-4-isopropylnaphthaIene; 1,6-Dimethyl-4-isopropylnaphthalene

Condensed phase thermochemistry data

Data compiled by: Hussein Y. Afeefy, Joel F. Liebman, and Stephen E. Stein
Quantity | Value | Units | Method | Reference | Comment |
---|---|---|---|---|---|
ΔcH°solid | -1993.4 ± 1.0 | kcal/mol | Ccb | Perrottet, Taub, et al., 1940 | Corresponding ΔfHºsolid = -32.2 kcal/mol (simple calculation by NIST; no Washburn corrections) |

Van Den Dool and Kratz RI, non-polar column, temperature ramp

Data compiled by: NIST Mass Spectrometry Data Center, William E. Wallace, director

Column type CapillaryCapillaryCapillaryCapillaryCapillary
Active phase BP-1BP-1DB-1DB-5HP-5MS
Column length (m) 50.50.30.30.30.
Carrier gas  HeN2HeHe
Substrate
Column diameter (mm) 0.220.220.250.320.25
Phase thickness (μm) 0.250.250.250.250.25
Tstart (C) 60.60.50.60.60.
Tend (C) 220.220.220.280.280.
Heat rate (K/min) 2.2.4.3.4.
Initial hold (min)     5.
Final hold (min) 20.20.
I 1655.1651.1682.1663.1684.
ReferenceBlanc, Bradesi, et al., 2006Gonny, Cavaleiro, et al., 2006Kuiate, Bessière, et al., 2006Pavlovic, Tzakou, et al., 2006Saroglou, Dorizas, et al., 2006
Comment MSDC-RI MSDC-RI MSDC-RI MSDC-RI MSDC-RI
Column type CapillaryCapillaryCapillaryCapillaryCapillary
Active phase HP-5MSRTX-1HP-5MSHP-5DB-5
Column length (m) 30.60.30.30.25.
Carrier gas H2 HeHeN2
Substrate
Column diameter (mm) 0.250.220.250.250.25
Phase thickness (μm) 0.250.250.250.250.25
Tstart (C) 50.60.60.50.75.
Tend (C) 285.220.250.290.210.
Heat rate (K/min) 4.32.4.4.3.
Initial hold (min)   2. 10.
Final hold (min)  20.20. 1.
I 1679.1653.1673.1675.1670.
ReferenceVujisic L., Vuckovic I., et al., 2006Cozzani, Muselli, et al., 2005Pino, Mesa, et al., 2005Flach A., Dondon R.C., et al., 2004bin Ahmad and bin Jantan, 2003
Comment MSDC-RI MSDC-RI MSDC-RI MSDC-RI MSDC-RI
Column type CapillaryCapillaryCapillaryCapillaryCapillary
Active phase OV-1RTX-1HP-5HP-5MSDB-1
Column length (m) 25.60.30.30.25.
Carrier gas H2HeHe N2
Substrate
Column diameter (mm) 0.250.220.250.250.25
Phase thickness (μm) 0.30.250.250.25
Tstart (C) 50.60.60.50.60.
Tend (C) 200.230.280.280.180.
Heat rate (K/min) 3.2.3.3.3.
Initial hold (min) 1.  5.10.
Final hold (min) 20.45.  10.
I 1643.1654.1675.1674.1660.
ReferenceBicchi, Rubiolo, et al., 2003Cavalli, Tomi, et al., 2003Tzakou, Couladis, et al., 2003Demetzos, Angelopoulou, et al., 2002bin Jantan and bin Ahmad, 2002
Comment MSDC-RI MSDC-RI MSDC-RI MSDC-RI MSDC-RI
Column type CapillaryCapillaryCapillaryCapillaryCapillary
Active phase DB-5HP-5HP-5MSHP-5HP-5
Column length (m) 30.30.30.30.30.
Carrier gas HeHeHeHeHe
Substrate
Column diameter (mm) 0.250.250.250.250.25
Phase thickness (μm) 0.250.250.250.250.25
Tstart (C) 60.60.60.50.50.
Tend (C) 260.260.280.280.280.
Heat rate (K/min) 4.3.4.4.4.
Initial hold (min)   5.5.5.
Final hold (min)  10.
I 1674.1674.1674.1674.1676.
ReferenceJavidnia, Miri, et al., 2002Couladis, Baziou, et al., 2001Skaltsa, Mavrommati, et al., 2001Lazari, Skaltsa, et al., 2000Skaltsa, Lazari, et al., 2000
Comment MSDC-RI MSDC-RI MSDC-RI MSDC-RI MSDC-RI
Column type CapillaryCapillaryCapillary
Active phase CP Sil 5 CBDB-5DB-1
Column length (m) 25.30.30.
Carrier gas HeHeHe
Substrate
Column diameter (mm) 0.250.260.20
Phase thickness (μm)  0.250.20
Tstart (C) 60.50.70.
Tend (C) 260.225.200.
Heat rate (K/min) 5.2.4.
Initial hold (min)   5.
Final hold (min)  20.
I 1662.1645.1647.
ReferenceWeyerstahl, Marschall, et al., 1999Sagrero-Nieves, Bartley, et al., 1997Stashenko, Wiame, et al., 1995
Comment MSDC-RI MSDC-RI MSDC-RI

Normal alkane RI, polar column, custom temperature program

Data compiled by: NIST Mass Spectrometry Data Center, William E. Wallace, director

Column type CapillaryCapillaryCapillaryCapillaryCapillary
Active phase Innowax FSCInnowaxHP InnowaxInnowax FSCHP Innowax
Column length (m) 60.60.60.60.50.
Carrier gas Helium  HeliumHelium
Substrate
Column diameter (mm) 0.250.250.250.250.20
Phase thickness (μm) 0.250.330.330.250.25
Program 60 0C (10 min) 4 0C/min -> 220 0C 1 0C/min -> 240 0Cnot specifiednot specified60 0C (10 min) 4 0C/min -> 220 0C (10 min) 1 0C/min -> 240 0C40 0C (5 min) 2 0C/min -> 270 0C -> 260 0C (20 min)
I 2256.2256.2256.2256.2256.
ReferenceBardakci, Demirci, et al., 2012Noorizadeh, Farmany, et al., 2011Noorizadeh and Farmany, 2010Baser, Demirci, et al., 2009Mancini, Arnold, et al., 2009
Comment MSDC-RI MSDC-RI MSDC-RI MSDC-RI MSDC-RI
Column type CapillaryCapillaryCapillaryCapillaryCapillary
Active phase HP-Innowax FSCHP-Innowax FSCHP-InnowaxCarbowax 20MInnowax
Column length (m) 60.60.50. 60.
Carrier gas N2He  He
Substrate
Column diameter (mm) 0.250.250.2 0.25
Phase thickness (μm) 0.250.250.2 0.25
Program 60C(10min) => 4C/min => 220C => (10min) => 1C/min => 240C60C(10min) => 4C/min => 220C(10min) => 1C/min => 240Cnot specifiednot specified60C(10min) => 4C/min => 220C(10min) => 1C/min => 240C (20min)
I 2256.2256.2256.2250.2256.
ReferenceTabanca, Demirci, et al., 2006Sezik E., Kocakulak E., et al., 2005Senatore, Apostolides Arnold, et al., 2004Vinogradov, 2004Tunaher, Kirimer, et al., 2003
Comment MSDC-RI MSDC-RI MSDC-RI MSDC-RI MSDC-RI
Column type CapillaryCapillaryCapillaryCapillaryCapillary
Active phase HP-InnowaxHP-Innowax FSCHP-InnowaxDB-WaxDB-Wax
Column length (m) 60.60.60.60.60.
Carrier gas HeHeHeN2N2
Substrate
Column diameter (mm) 0.250.250.25
Phase thickness (μm) 0.250.250.250.250.25
Program 60 0C (10 min) 4 K/min -> 220 0C (10 min) 1 K/min -> 240 0C60C(10min) => 4C/min => 220C(10min) => 1C/min => 240C60C(10min) => 4C/min => 220C(10min) => 1C/min => 240Cnot specifiednot specified
I 2256.2256.2256.2233.2233.
ReferenceBaser, Demirci, et al., 2002Kirimer N., Tabanea N., et al., 2001Tabanca, Kirimer, et al., 2001Weyerstahl, Marschall, et al., 1998Weyerstahl, Marschall, et al., 1998, 2
Comment MSDC-RI MSDC-RI MSDC-RI MSDC-RI MSDC-RI

Normal alkane RI, non-polar column, temperature ramp

Data compiled by: NIST Mass Spectrometry Data Center, William E. Wallace, director

Column type CapillaryCapillaryCapillaryCapillaryCapillary
Active phase HP-5 MSCP-Sil 5 CBSPB-1DB-5HP-5 MS
Column length (m) 30.30.30.30.30.
Carrier gas HeliumNitrogenHeliumHeliumHelium
Substrate
Column diameter (mm) 0.250.250.250.250.25
Phase thickness (μm) 0.250.260.250.250.25
Tstart (C) 35.45.50.60.70.
Tend (C) 300.280.250.240.290.
Heat rate (K/min) 3.3.5.3.5.
Initial hold (min) 5. 3.
Final hold (min) 15.22.15. 10.
I 1671.1665.1678.1670.1676.
ReferenceKotowska, Zalikowski, et al., 2012Mothana, Hasson, et al., 2011Lazarevic, Palic, et al., 2010Magalhaes, Lima, et al., 2010Radulovic, Dordevic, et al., 2010
Comment MSDC-RI MSDC-RI MSDC-RI MSDC-RI MSDC-RI
Column type CapillaryCapillaryCapillaryCapillaryCapillary
Active phase HP-5 MSHP-5DB-5 MSRTX-1HP-5 MS
Column length (m) 30.30.30.60.30.
Carrier gas  NitrogenHeliumHeHelium
Substrate
Column diameter (mm) 0.250.250.250.220.25
Phase thickness (μm)  0.250.250.250.25
Tstart (C) 60.50.50.60.50.
Tend (C) 280.280.300.230.230.
Heat rate (K/min) 3.5.5.2.3.
Initial hold (min)  1.5. 10.
Final hold (min)  1.5.35.10.
I 1674.1658.1677.1658.1675.
ReferenceBaziou, Couladis, et al., 2008Bousaada, Ammar, et al., 2008Noudogbessi, Yedomonhan, et al., 2008Paolini, Tomi, et al., 2008Adams, Beauchamp, et al., 2007
Comment MSDC-RI MSDC-RI MSDC-RI MSDC-RI MSDC-RI
Column type CapillaryCapillaryCapillaryCapillaryCapillary
Active phase HP-5SE-30HP-5HP-5MSHP-1
Column length (m) 30.30.30.30.50.
Carrier gas N2HeHeHeHe
Substrate
Column diameter (mm) 0.250.250.250.250.2
Phase thickness (μm) 0.250.250.250.250.5
Tstart (C) 50.40.40.60.60.
Tend (C) 240.250.250.280.250.
Heat rate (K/min) 5.5.5.3.2.
Initial hold (min) 1.5.5.
Final hold (min) 4.10.10. 120.
I 1674.1673.1677.1675.1645.
ReferenceCheraif, Ben Jannet, et al., 2007Loizzo, Tundis, et al., 2007Loizzo, Tundis, et al., 2007Bozin, Mimicá-Dukic, et al., 2006Castel, Fernandez, et al., 2006
Comment MSDC-RI MSDC-RI MSDC-RI MSDC-RI MSDC-RI
Column type CapillaryCapillaryCapillaryCapillaryCapillary
Active phase HP-1DB-5DB-5BP-1DB-5
Column length (m) 50.30.30.50.30.
Carrier gas HeHeHeHeHe
Substrate
Column diameter (mm) 0.20.250.250.220.25
Phase thickness (μm) 0.330.250.250.250.25
Tstart (C) 60.60.60.60.60.
Tend (C) 250.240.240.220.220.
Heat rate (K/min) 2.5.5.2.4.
Initial hold (min)  2.2. 5.
Final hold (min) 40.  20.
I 1645.1674.1674.1656.1679.
ReferenceFilippi, Lanfranchi, et al., 2006Gohari, Hadjiakhoondi, et al., 2006Gohari A.R., Hadjiakhoondi A., et al., 2006Lesueur, Ban, et al., 2006Morteza-Semnani K., Saeedi M., et al., 2006
Comment MSDC-RI MSDC-RI MSDC-RI MSDC-RI MSDC-RI
Column type CapillaryCapillaryCapillaryCapillaryCapillary
Active phase DB-5DB-5HP-5DB-5DB-5
Column length (m) 30.30.30.30.30.
Carrier gas HydrogenHeHeHeHe
Substrate
Column diameter (mm) 0.250.250.250.250.25
Phase thickness (μm) 0.250.250.250.250.25
Tstart (C) 70.40.60.60.60.
Tend (C) 280.260.250.240.240.
Heat rate (K/min) 4.2.10.3.3.
Initial hold (min) 4.5.2.
Final hold (min)  20.10.
I 1673.1673.1696.1674.1675.
ReferencePino, Marbot, et al., 2006Senatore, Landolfi, et al., 2006Wang, Yang, et al., 2006Chaverri and Cicció, 2005Chaverri and Cicció, 2005
Comment MSDC-RI MSDC-RI MSDC-RI MSDC-RI MSDC-RI
Column type CapillaryCapillaryCapillaryCapillaryCapillary
Active phase DB-5MSBP-1DB-1HP-5DB-5
Column length (m) 30.50.30.25.30.
Carrier gas He N2H2He
Substrate
Column diameter (mm) 0.250.220.250.320.25
Phase thickness (μm) 0.250.250.250.520.25
Tstart (C) 60.60.50.40.60.
Tend (C) 280.220.200.240.240.
Heat rate (K/min) 3.2.5.4.3.
Initial hold (min) 30.
Final hold (min)  20.
I 1637.1654.1671.1674.1671.
ReferenceMarongiu, Piras, et al., 2005Blanc, Muselli, et al., 2004Fekam Boyom, Fotio, et al., 2004Simic, Sokovic, et al., 2004Tellez, Khan, et al., 2004
Comment MSDC-RI MSDC-RI MSDC-RI MSDC-RI MSDC-RI
Column type CapillaryCapillaryCapillaryCapillaryCapillary
Active phase DB-1HP-5MSDB-5DB-5HP-5
Column length (m) 30.30.30.30.30.
Carrier gas N2HeHeHeHe
Substrate
Column diameter (mm) 0.250.250.250.250.25
Phase thickness (μm) 0.250.250.250.250.25
Tstart (C) 50.60.60.60.60.
Tend (C) 200.275.280.280.280.
Heat rate (K/min) 5.4.3.3.3.
Initial hold (min)
Final hold (min)   30.30.
I 1636.1679.1661.1659.1656.
ReferenceFekam Boyom, Ngouana, et al., 2003Ghannadi, Aghazari, et al., 2003Marongiu, Porcedda, et al., 2003Marongiu, Porcedda, et al., 2003Pitarokili, Tzakou, et al., 2003
Comment MSDC-RI MSDC-RI MSDC-RI MSDC-RI MSDC-RI
Column type CapillaryCapillaryCapillaryCapillaryCapillary
Active phase DB-5DB-5DB-5DB-5HP-5
Column length (m) 30.25.30.30.30.
Carrier gas HeN2 HeH2
Substrate
Column diameter (mm) 0.250.250.250.250.25
Phase thickness (μm) 0.250.250.250.250.25
Tstart (C) 60.50.40.60.40.
Tend (C) 240.250.210.220.280.
Heat rate (K/min) 3.4.2.4.4.
Initial hold (min)   2.5.
Final hold (min)  10.33.
I 1675.1673.1680.1678.1674.
ReferenceZoghbi, Andrade, et al., 2003Zrira, Elamrani, et al., 2003Kabouss, Charrouf, et al., 2002Morteza-Semnani, Saeedi, et al., 2002Velickovic, Randjelovic, et al., 2002
Comment MSDC-RI MSDC-RI MSDC-RI MSDC-RI MSDC-RI
Column type CapillaryCapillaryCapillaryCapillaryCapillary
Active phase RTX-1DB-5MSOptima-1HP-1DB-5
Column length (m) 30.30.25.25.30.
Carrier gas N2HeHeH2He
Substrate
Column diameter (mm) 0.250.250.200.320.25
Phase thickness (μm) 0.250.250.250.170.25
Tstart (C) 60.60.50.40.65.
Tend (C) 300.240.250.260.300.
Heat rate (K/min) 4.3.3.3.4.
Initial hold (min)   3.5.2.
Final hold (min)  30.
I 1660.1646.1662.1641.1669.
ReferenceKalemba, Marschall, et al., 2001Marongiu, Porcedda, et al., 2001de Beck, Bessière, et al., 2000Lopes, Koketsu, et al., 1999Elias, Simoneit, et al., 1997
Comment MSDC-RI MSDC-RI MSDC-RI MSDC-RI MSDC-RI
Column type CapillaryCapillaryCapillaryCapillaryCapillary
Active phase DB-1DB-1HP-1SE-30SE-30
Column length (m) 60.60.25.30.30.
Carrier gas HeHeHelium
Substrate
Column diameter (mm) 0.320.250.32
Phase thickness (μm) 0.500.250.25
Tstart (C) 50.50.60.50.50.
Tend (C) 250.250.220.240.240.
Heat rate (K/min) 8.2.54.4.4.
Initial hold (min) 1.5.2.2.2.
Final hold (min) 6. 20.10.10.
I 1630.1641.1650.1646.1646.
ReferenceSagrero-Nieves and Bartley, 1996Stashenko, Puertas, et al., 1996Thanh, Dung, et al., 1996Ramaswami, Briscese, et al., 1988Ramaswami, Briscese, et al., 1986
Comment MSDC-RI MSDC-RI MSDC-RI MSDC-RI MSDC-RI

Kovats' RI, non-polar column, temperature ramp

Data compiled by: NIST Mass Spectrometry Data Center, William E. Wallace, director

Column type CapillaryCapillaryCapillaryCapillaryCapillary
Active phase CP Sil 8 CBCP Sil 8 CBDB-5DB-5CP Sil 8 CB
Column length (m) 30.30.30.30.30.
Carrier gas H2H2HeHeH2
Substrate
Column diameter (mm) 0.250.250.260.260.25
Phase thickness (μm) 0.250.250.250.250.25
Tstart (C) 50.50.60.60.50.
Tend (C) 220.220.246.246.220.
Heat rate (K/min) 3.3.3.3.3.
Initial hold (min) 2.2.  2.
Final hold (min)
I 1668.1668.1677.1674.1652.
ReferenceTayoub, Schwob, et al., 2006Tayoub, Schwob, et al., 2006, 2Adams, Morris, et al., 2005Adams and Nguyen, 2005Schwob, Bessiere, et al., 2004
Comment MSDC-RI MSDC-RI MSDC-RI MSDC-RI MSDC-RI
Column type CapillaryCapillaryCapillaryCapillaryCapillary
Active phase HP-5MSDB-5HP-1HP-5DB-5
Column length (m) 30.30.50.30.30.
Carrier gas HeHeHeHeHe
Substrate
Column diameter (mm) 0.250.250.250.250.26
Phase thickness (μm) 0.250.250.250.250.25
Tstart (C) 60.60.100.60.60.
Tend (C) 280. 250.280.246.
Heat rate (K/min) 3.3.5.3.3.
Initial hold (min)   7.
Final hold (min)
I 1652.1674.1653.1671.1674.
ReferenceGkinis, Tzakou, et al., 2003Lucero, Estell, et al., 2003Raina, Srivastava, et al., 2001Tzakou and Couladis, 2001Adams, 2000
Comment MSDC-RI MSDC-RI MSDC-RI MSDC-RI MSDC-RI
Column type CapillaryCapillaryCapillaryCapillaryCapillary
Active phase Methyl SiliconeDB-5HP-5MSBPX-5DB-5
Column length (m) 30.30.30.50.30.
Carrier gas He HeN2He
Substrate
Column diameter (mm) 0.320.320.320.220.25
Phase thickness (μm) 0.25 0.250.250.25
Tstart (C) 60.50.70.60.40.
Tend (C) 225.250.250.185.250.
Heat rate (K/min) 2.3.3.2.2.
Initial hold (min) 2.5.5.10.5.
Final hold (min) 5.   20.
I 1662.1682.1674.1675.1654.
ReferenceJayaprakasha, Rao, et al., 2000Tzakou, Harvala, et al., 2000Siani, Ramos, et al., 1999Fournier, Hadjiakhoondi, et al., 1997Senatore, Urrunaga Soria, et al., 1997
Comment MSDC-RI MSDC-RI MSDC-RI MSDC-RI MSDC-RI

Van Den Dool and Kratz RI, non-polar column, custom temperature program

Data compiled by: NIST Mass Spectrometry Data Center, William E. Wallace, director

Column type CapillaryCapillary
Active phase HP-5MSSE-52
Column length (m) 30.30.
Carrier gas HeHe
Substrate
Column diameter (mm) 0.250.32
Phase thickness (μm) 0.250.15
Program 60C (1 min) => 5 C/min => 210C => 10 C/min => 280C (15 min)45C => 1C/min => 100C => 5C/min => 250C(10min)
I 1688.11677.
ReferenceAndriamaharavo, 2014Bruni, Pellati, et al., 2005
Comment MSDC-RI MSDC-RI

Phase change data

Data compiled by: Robert L. Brown and Stephen E. Stein

Reduced pressure boiling point

Tboil (K) Pressure (atm) Reference
564.70.947Weast and Grasselli, 1989

References

Perrottet, Taub, et al., 1940
Perrottet, E.; Taub, W.; Briner, E.,
Sur etats energetiques comparatifs des noyaux azulenique et naphtalenique,
Helv. Chim. Acta, 1940, 23, 1260-1268. [all data]