2H-Furo[2,3-h]-1-benzopyran-2-one, 5-methoxy-
- Formula: C12H8O4
- Molecular weight: 216.1895
- IUPAC Standard InChIKey: AJSPSRWWZBBIOR-UHFFFAOYSA-N
- CAS Registry Number: 482-48-4
- Chemical structure:
View 3d structure (requires JavaScript / HTML 5) - Other names: Isobergapten; Isobergaptene; 5-Methoxyangelicin

Normal alkane RI, non-polar column, temperature ramp

Column type | Active phase | I | Reference | Comment |
---|---|---|---|---|
Capillary | 5 % Phenyl methyl siloxane | 2016. | Marongiu, Piras, et al., 2006 | 30. m/0.25 mm/0.25 μm, Helium, 3. K/min, 280. C @ 30. min; Tstart: 60. C |

References

Marongiu, Piras, et al., 2006
Marongiu, B.; Piras, A.; Porcedda, S.; Tuveri, E.; Maxia, A.,
Isolation of Seseli bocconi Guss. volatile oil by supercritical carbon dioxide extraction,
Natural Product Research, 2006, 20, 9, 820-826, https://doi.org/10.1080/14786410500364684
. [all data]