2-Propenoic acid, 2-bromoethyl ester
- Formula: C5H7BrO2
- Molecular weight: 179.012
- IUPAC Standard InChIKey: CDZAAIHWZYWBSS-UHFFFAOYSA-N
- CAS Registry Number: 4823-47-6
- Chemical structure:
View 3d structure (requires JavaScript / HTML 5) - Other names: Acrylic acid, 2-bromoethyl ester; 2-Bromoethyl acrylate

Phase change data

Data compiled by: Robert L. Brown and Stephen E. Stein
Reduced pressure boiling point
Tboil (K) | Pressure (bar) | Reference |
---|---|---|
326. | 0.007 | Frinton Laboratories Inc., 1986 |

References

Frinton Laboratories Inc., 1986
Frinton Laboratories Inc.,
Catalog Number 11, Frinton Laboratories Inc., Vineland, NJ, 1986, 99. [all data]