Cholestane
- Formula: C27H48
- Molecular weight: 372.6700
- IUPAC Standard InChIKey: XIIAYQZJNBULGD-BTSBFKJRSA-N
- CAS Registry Number: 481-21-0
- Chemical structure:
- Other names: Cholestane, (5α)-; 5α-Cholestane; α-Cholestane; 28,29,30-Trinorlanostane; 10,13-Dimethyl-17-(1',5'-dimethylhexyl)-hexadecahydrocyclopenta(a)phenanthrene; 5A-Cholestane, TMS; 17-(1,5-Dimethylhexyl)-10,13-dimethyl-hexahydro-1H-cyclopenta[a]-phenanthrene (5-α-cholestane)

Phase change data

Data compiled by: William E. Acree, Jr., James S. Chickos
Quantity | Value | Units | Method | Reference | Comment |
---|---|---|---|---|---|
ΔsubH° | 31.98 | kcal/mol | N/A | Mokbel, Ruzicka, et al., 2000 |
Enthalpy of vaporization
ΔvapH (kcal/mol) | Temperature (K) | Method | Reference | Comment |
---|---|---|---|---|
25.91 | 352. | N/A | Mokbel, Ruzicka, et al., 2000 | |
27.63 | 496. | A | Stephenson and Malanowski, 1987 | Based on data from 481. to 538. K. |
Enthalpy of fusion
ΔfusH (kcal/mol) | Temperature (K) | Reference |
---|---|---|
6.07 | 351.8 | Mokbel, Ruzicka, et al., 2000 |

Reaction thermochemistry data

Data compiled by: Hussein Y. Afeefy, Joel F. Liebman, and Stephen E. Stein

Individual Reactions

Hydrogen + Cholest-2-ene = Cholestane

By formula: H2 + C27H46 = C27H48

Quantity Value Units Method Reference Comment
Δr-108.2 ± 0.71kJ/molChydTurner, Meador, et al., 1957liquid phase; solvent: Acetic acid

Hydrogen + Cholest-3-ene = Cholestane

By formula: H2 + C27H46 = C27H48

Quantity Value Units Method Reference Comment
Δr-117.0 ± 0.59kJ/molChydTurner, Meador, et al., 1957liquid phase; solvent: Acetic acid

Hydrogen + C27H46 = Cholestane

By formula: H2 + C27H46 = C27H48

Quantity Value Units Method Reference Comment
Δr-114.2 ± 1.0kJ/molChydTurner, Meador, et al., 1957liquid phase; solvent: Acetic acid

Hydrogen + Cholest-6-ene = Cholestane

By formula: H2 + C27H46 = C27H48

Quantity Value Units Method Reference Comment
Δr-114.5 ± 0.4kJ/molChydTurner, Meador, et al., 1957liquid phase; solvent: Acetic acid

Hydrogen + Cholest-5-ene = Cholestane

By formula: H2 + C27H46 = C27H48

Quantity Value Units Method Reference Comment
Δr-108.2 ± 0.54kJ/molChydTurner, Meador, et al., 1957liquid phase; solvent: Acetic acid

Kovats' RI, non-polar column, isothermal

Data compiled by: NIST Mass Spectrometry Data Center, William E. Wallace, director

Column type CapillaryCapillaryCapillary
Active phase CP Sil 5 CBMethyl SiliconeOV-101
Column length (m) 50. 23.
Carrier gas H2 He
Substrate
Column diameter (mm) 0.22 0.3
Phase thickness (μm) 0.12
Temperature (C) 270.250.250.
I 2866.2857.2857.
Referencevan Gelder, Jonker, et al., 1988Shlyakhov, 1984Kimble, Maxwell, et al., 1974
Comment MSDC-RI MSDC-RI MSDC-RI

Kovats' RI, non-polar column, custom temperature program

Data compiled by: NIST Mass Spectrometry Data Center, William E. Wallace, director

Column type Packed
Active phase SE-30
Column length (m) 1.5
Carrier gas He
Substrate Chromosorb G HP (80-100 mesh)
Column diameter (mm)
Phase thickness (μm)
Program not specified
I 2852.
ReferenceRamsey, Lee, et al., 1980
Comment MSDC-RI

References

Mokbel, Ruzicka, et al., 2000
Mokbel, Ilham; Ruzicka, Kvetoslav; Majer, Vladimir; Ruzicka, Vlastimil; Ribeiro, Madeleine; Jose, Jacques; Zábranský, Milan,
Vapor pressures and thermal data for three high-boiling compounds of petroleum interest: 1-phenyldodecane, (5α)-cholestane, adamantane,
Fluid Phase Equilibria, 2000, 169, 2, 191-207, https://doi.org/10.1016/S0378-3812(99)00342-8
. [all data]
Stephenson and Malanowski, 1987
Stephenson, Richard M.; Malanowski, Stanislaw,
Handbook of the Thermodynamics of Organic Compounds, 1987, https://doi.org/10.1007/978-94-009-3173-2
. [all data]