Naphtho[1,2-b]furan-2,8(3H,4H)-dione, 3a,5,5a,9b-tetrahydro-3,5a,9-trimethyl-, [3R-(3α,3aβ,5aα,9bα)]-
- Formula: C15H18O3
- Molecular weight: 246.3016
- IUPAC Standard InChIKey: XJHDMGJURBVLLE-OMSPQPPYSA-N
- CAS Registry Number: 481-07-2
- Chemical structure:
View 3d structure (requires JavaScript / HTML 5) - Stereoisomers:
- Other names: Eudesma-1,4-dien-12-oic acid, 6α-hydroxy-3-oxo-, γ-lactone, (11R)-; β-Santonin; β-Santonin-[3R-(3α,3aβ,5aα,9bα)]- 3a,5,5a,9b-tetrahydro- 3,5a,9-trimethylnaphthalene

Condensed phase thermochemistry data

Data compiled by: Hussein Y. Afeefy, Joel F. Liebman, and Stephen E. Stein
Quantity | Value | Units | Method | Reference | Comment |
---|---|---|---|---|---|
ΔfH°solid | -587.3 ± 1.8 | kJ/mol | Ccb | Cocker, McMurry, et al., 1964 | %hf298 calculated possible error by the author |
Quantity | Value | Units | Method | Reference | Comment |
ΔcH°solid | -7887.8 ± 1.8 | kJ/mol | Ccb | Cocker, McMurry, et al., 1964 | %hf298 calculated possible error by the author; Corresponding ΔfHºsolid = -587.31 kJ/mol (simple calculation by NIST; no Washburn corrections) |

References

Cocker, McMurry, et al., 1964
Cocker, W.; McMurry, T.B.H.; Frisch, M.A.; McAllister, T.; Mackle, H.,
Stabilities of some santonin derivatives,
Tetrahedron Lett., 1964, 23, 2235-2237. [all data]