α-Santonin
- Formula: C15H18O3
- Molecular weight: 246.3016
- IUPAC Standard InChIKey: XJHDMGJURBVLLE-BOCCBSBMSA-N
- CAS Registry Number: 481-06-1
- Chemical structure:
View 3d structure (requires JavaScript / HTML 5) - Stereoisomers:
- Other names: Naphtho[1,2-b]furan-2,8(3H,4H)-dione, 3a,5,5a,9b-tetrahydro-3,5a,9-trimethyl-, [3S-(3α,3aα,5aβ,9bβ)]-; Eudesma-1,4-dien-12-oic acid, 6α-hydroxy-3-oxo-, γ-lactone, (11S)-; (-)-α-Santonin; (-)-Santonin; (-)-Santonine; Santonin; Semenen; 1,2,3,4,4a,7-Hexahydro-1-hydroxy-α, 4a,8-trimethyl-7-oxo-2-naphthaleneacetic acid γ-lactone; l-α-Santonin; Naphtho(1,2-b)furan-2,8(3H,4H)-dione, 3a,5,5a,9b-tetrahydro-3,5a,9-trimethyl-, (3S,3aS,5aS,9bS)-; Santoninic anhydride; 11-Epiisoeusantona-1,4-dienic acid, 6α-hydroxy-3-oxo-, γ-lactone; [3S-(3α,3aα,5aβ,9bβ)]-3a,5,5a,9b-Tetrahydro-3,5a,9-trimethylnaphtho[1,2-b]furan-2,8(3H,4H)dione; NSC 4900; α-Santonine; (3S,3aS,5aS,9bS)-2,3,3a,4,5,5a,8,9b-octahydro-3,5a,9-trimethylnaphtho[1,2-b]furan-2,8-dione

Condensed phase thermochemistry data

Data compiled by: Hussein Y. Afeefy, Joel F. Liebman, and Stephen E. Stein
Quantity | Value | Units | Method | Reference | Comment |
---|---|---|---|---|---|
ΔfH°solid | -141.22 ± 0.54 | kcal/mol | Ccb | Cocker, McMurry, et al., 1964 | |
Quantity | Value | Units | Method | Reference | Comment |
ΔcH°solid | -1884.40 ± 0.54 | kcal/mol | Ccb | Cocker, McMurry, et al., 1964 | Corresponding ΔfHºsolid = -141.20 kcal/mol (simple calculation by NIST; no Washburn corrections) |

Normal alkane RI, non-polar column, custom temperature program

Column type | Active phase | I | Reference | Comment |
---|---|---|---|---|
Capillary | 2117. | El-Shazily, Hafez, et al., 2004 | Program: not specified |

References

Cocker, McMurry, et al., 1964
Cocker, W.; McMurry, T.B.H.; Frisch, M.A.; McAllister, T.; Mackle, H.,
Stabilities of some santonin derivatives,
Tetrahedron Lett., 1964, 23, 2235-2237. [all data]