Acenaphthylene, 1,2,2a,3,4,5-hexahydro-
- Formula: C12H14
- Molecular weight: 158.2396
- IUPAC Standard InChIKey: BDAGIAXQQBRORQ-UHFFFAOYSA-N
- CAS Registry Number: 480-72-8
- Chemical structure:
View 3d structure (requires JavaScript / HTML 5) - Species with the same structure:
- Other names: Acenaphthene, 2a,3,4,5-tetrahydro-; (1-4)-Tetrahydroacenaphthene; Tetraphthen; Tetraphthene; 2a,3,4,5-Tetrahydroacenaphthene; Tetrahydroacenaphthene; 1,2,2a,3,4,5-Hexahydroacenaphthylene; 2a,3,4,5-Tetrahydroacenaphthalene

Kovats' RI, non-polar column, isothermal

Column type | Active phase | Temperature (C) | I | Reference | Comment |
---|---|---|---|---|---|
Packed | SE-30 | 150. | 1378. | Shlyakhov, Anvaer, et al., 1975 |

Van Den Dool and Kratz RI, non-polar column, temperature ramp

Column type | Active phase | I | Reference | Comment |
---|---|---|---|---|
Capillary | OV-1 | 1359.8 | Gautzsch and Zinn, 1996 | 8. K/min; Tstart: 35. C; Tend: 300. C |
Capillary | SE-52 | 1357. | Beernaert, 1979 | He, 50. C @ 5. min, 6. K/min; Column length: 33.3 m; Column diameter: 0.50 mm; Tend: 320. C |

Normal alkane RI, non-polar column, temperature ramp

Column type | Active phase | I | Reference | Comment |
---|---|---|---|---|
Capillary | Ultra-1 | 1360. | Elizalde-González, Hutfliess, et al., 1996 | 50. m/0.2 mm/0.33 μm, H2, 3. K/min, 300. C @ 35. min; Tstart: 60. C |

Lee's RI, non-polar column, temperature ramp

Column type | Active phase | I | Reference | Comment |
---|---|---|---|---|
Capillary | SE-52 | 232.70 | Lee, Vassilaros, et al., 1979 | 12. m/0.3 mm/0.34 μm, He, 2. K/min; Tstart: 50. C; Tend: 250. C |

References

Shlyakhov, Anvaer, et al., 1975
Shlyakhov, A.F.; Anvaer, B.I.; Zolotareva, O.V.; Romina, N.N.; Novikova, N.V.; Koreshkova, R.I.,
On the possibility of group indentification of hydrocarbons by gas chromatography from temperature coefficients of retention indices,
Zh. Anal. Khim., 1975, 30, 788-792. [all data]
Gautzsch and Zinn, 1996
Gautzsch, R.; Zinn, P.,
Use of incremental models to estimate the retention indexes of aromatic compounds,
Chromatographia, 1996, 43, 3/4, 163-176, https://doi.org/10.1007/BF02292946
. [all data]
Beernaert, 1979
Beernaert, H.,
Gas Chromatographic Analysis of Polyclylic Aromatic Hydrocarbons,
J. Chromatogr., 1979, 173, 1, 109-118, https://doi.org/10.1016/S0021-9673(01)80450-7
. [all data]
Elizalde-González, Hutfliess, et al., 1996
Elizalde-González, M.P.; Hutfliess, M.; Hedden, K.,
Retention index system, adsorption characteristics, and sructure correlations of polycyclic aromatic hydrocarbons in fuels,
J. Hi. Res. Chromatogr., 1996, 19, 6, 345-352, https://doi.org/10.1002/jhrc.1240190608
. [all data]
Lee, Vassilaros, et al., 1979
Lee, M.L.; Vassilaros, D.L.; White, C.M.; Novotny, M.,
Retention Indices for Programmed-Temperature Capillary-Column Gas Chromatography of Polycyclic Aromatic Hydrocarbons,
Anal. Chem., 1979, 51, 6, 768-773, https://doi.org/10.1021/ac50042a043
. [all data]