Benzoic acid, 2,4,6-trimethyl-
- Formula: C10H12O2
- Molecular weight: 164.2011
- IUPAC Standard InChIKey: FFFIRKXTFQCCKJ-UHFFFAOYSA-N
- CAS Registry Number: 480-63-7
- Chemical structure:
View 3d structure (requires JavaScript / HTML 5) - Other names: β-Isodurylic acid; Mesitoic acid; 2,4,6-Trimethylbenzoic acid

Gas phase ion energetics data

Data compiled by: John E. Bartmess
De-protonation reactions
C10H11O2- + =
By formula: C10H11O2- + H+ = C10H12O2
Quantity | Value | Units | Method | Reference | Comment |
---|---|---|---|---|---|
ΔrH° | 1418. ± 8.8 | kJ/mol | G+TS | Decouzon, Ertl, et al., 1993 | gas phase; relative to benzoate at 333.0 kcal/mol |
Quantity | Value | Units | Method | Reference | Comment |
ΔrG° | 1389. ± 8.4 | kJ/mol | IMRE | Decouzon, Ertl, et al., 1993 | gas phase; relative to benzoate at 333.0 kcal/mol |

Phase change data

Data compiled as indicated in comments:
ALS - Hussein Y. Afeefy, Joel F. Liebman, and Stephen E. Stein
DRB - Donald R. Burgess, Jr.
AC - William E. Acree, Jr., James S. Chickos

Quantity Value Units Method Reference Comment
Δsub103.6 ± 0.3kJ/molVColomina, Jimenez, et al., 1987see Colomina, Turrion, et al., 1964; ALS
Δsub103.6kJ/molN/AColomina, Jimenez, et al., 1987DRB
Δsub103.6 ± 0.3kJ/molMEColomina, Jimenez, et al., 1987Based on data from 316. - 340. K.; AC

Enthalpy of sublimation

ΔsubH (kJ/mol) Temperature (K) Method Reference Comment
102.5 ± 0.3328.MEColomina, Jimenez, et al., 1987Based on data from 316. - 340. K.; AC

References

Decouzon, Ertl, et al., 1993
Decouzon, M.; Ertl, P.; Exner, O.; Gal, J.F.; Maria, P.C.,
Concepts of Sterically Hindered Resonance and Buttressing Effect - Gas-Phase Acidities of Methyl-Substituted Benzoic Acids and Basicities of,
J. Am. Chem. Soc., 1993, 115, 25, 12071, https://doi.org/10.1021/ja00078a052
. [all data]