Naringenin

Phase change data

Data compiled by: William E. Acree, Jr., James S. Chickos

Enthalpy of fusion

ΔfusH (kJ/mol) Temperature (K) Method Reference
39.8523.2DSCChebil, Humeau, et al., 2007

References

Chebil, Humeau, et al., 2007
Chebil, Latifa; Humeau, Catherine; Anthoni, Julie; Dehez, François; Engasser, Jean-Marc; Ghoul, Mohamed, Solubility of Flavonoids in Organic Solvents, J. Chem. Eng. Data, 2007, 52, 5, 1552-1556, https://doi.org/10.1021/je7001094 . [all data]