2-Octen-4-ol
- Formula: C8H16O
- Molecular weight: 128.2120
- IUPAC Standard InChIKey: WGDUEFYADBRNKG-UHFFFAOYSA-N
- CAS Registry Number: 4798-61-2
- Chemical structure:
View 3d structure (requires JavaScript / HTML 5) - Stereoisomers:
- Other names: Octene-2-ol-4; oct-2-en-4-ol

Kovats' RI, non-polar column, isothermal

Column type | Active phase | Temperature (C) | I | Reference | Comment |
---|---|---|---|---|---|
Packed | SE-30 | 175. | 866. | Casteignau and Villessot, 1968 | Column length: 3. m |

Kovats' RI, polar column, isothermal

Column type | Active phase | Temperature (C) | I | Reference | Comment |
---|---|---|---|---|---|
Packed | Carbowax 20M | 175. | 1305. | Casteignau and Villessot, 1968 | Column length: 3. m |

Phase change data

Data compiled by: Thermodynamics Research Center, NIST Boulder Laboratories, Chris Muzny director
Quantity | Value | Units | Method | Reference | Comment |
---|---|---|---|---|---|
Tboil | 444. | K | N/A | Labarre, 1963 | Uncertainty assigned by TRC = 2. K |

References

Casteignau and Villessot, 1968
Casteignau, G.; Villessot, D.,
Identification par chromatographie en phase gaseuse de composés difonctionnels insaturés. I. Synthèse et indices de rétention,
Bull. Soc. Chim. Fr., 1968, 9, 3893-3903. [all data]