2-Hepten-4-ol
- Formula: C7H14O
- Molecular weight: 114.1855
- IUPAC Standard InChIKey: DODCYMXUZOEOQF-HWKANZROSA-N
- CAS Registry Number: 4798-59-8
- Chemical structure:
View 3d structure (requires JavaScript / HTML 5) - Permanent link for this species. Use this link for bookmarking this species for future reference.

Phase change data

Data compiled by: Thermodynamics Research Center, NIST Boulder Laboratories, Chris Muzny director
Quantity | Value | Units | Method | Reference | Comment |
---|---|---|---|---|---|
Tboil | 426. | K | N/A | Labarre, 1963 | Uncertainty assigned by TRC = 2. K |

References

Labarre, 1963
Labarre, J.F.,
Contribution to the Study of Magneto-Optics of Bonds Between Atoms in Aliphatic Hydrocarbons,
Ann. Chim., 1963, 8, 45-83. [all data]