7-Benzoyloxybicyclo[2.2.1]hepta-2,5-diene
- Formula: C14H12O2
- Molecular weight: 212.2439
- IUPAC Standard InChIKey: NTELHPJRBBSUIJ-UHFFFAOYSA-N
- CAS Registry Number: 4796-68-3
- Chemical structure:
View 3d structure (requires JavaScript / HTML 5) - Other names: 7-Benzoyloxynorbornadiene; 7-Norbornadienyl benzoate

Phase change data

Data compiled by: Robert L. Brown and Stephen E. Stein
Reduced pressure boiling point
Tboil (K) | Pressure (bar) | Reference |
---|---|---|
398. to 403. | 0.0020 | Frinton Laboratories Inc., 1986 |

References

Frinton Laboratories Inc., 1986
Frinton Laboratories Inc.,
Catalog Number 11, Frinton Laboratories Inc., Vineland, NJ, 1986, 99. [all data]