Naphthalene, 1,4,5,8-tetranitro-

Condensed phase thermochemistry data

Data compiled by: Hussein Y. Afeefy, Joel F. Liebman, and Stephen E. Stein

Quantity Value Units Method Reference Comment
Δfsolid47.3 ± 8.4kJ/molCcbRouse, 1976Author was aware that data differs from previously reported values
Δfsolid21.9kJ/molCcbMedard, 1954Heat of combustion corrected for pressure
Quantity Value Units Method Reference Comment
Δcsolid-4554.3 ± 4.2kJ/molCcbRouse, 1976Author was aware that data differs from previously reported values
Δcsolid-4528.72kJ/molCcbMedard, 1954Heat of combustion corrected for pressure

References

Rouse, 1976
Rouse, P.E., Jr., Enthalpies of formation and calculated detonation properties of some thermally stable explosives, J. Chem. Eng. Data, 1976, 21, 16-20. [all data]

Medard, 1954
Medard, L., Tables thermochimiques a l'usage des techniciens des substances explosives, Mem. Artillerie Fr. Sci. Tech. Armement, 1954, 28, 415-492. [all data]