1,2-Dihydroben[j]aceanthrylene
- Formula: C20H14
- Molecular weight: 254.3252
- IUPAC Standard InChIKey: KVFJBIQWENJTDM-UHFFFAOYSA-N
- CAS Registry Number: 479-23-2
- Chemical structure:
View 3d structure (requires JavaScript / HTML 5) - Other names: cholanthrene; 1,2-Dihydrobenz[j]aceanthrylene

Gas phase thermochemistry data

Data compiled by: Glushko Thermocenter, Russian Academy of Sciences, Moscow
Constant pressure heat capacity of gas
Cp,gas (J/mol*K) | Temperature (K) | Reference | Comment |
---|---|---|---|
53.58 | 50. | Dorofeeva O.V., 1989 | These statistically calculated values were obtained using force field approximation for polycyclic aromatic hydrocarbons to estimate the needed vibrational frequencies (see also [ Dorofeeva O.V., 1986, Moiseeva N.F., 1990]). These functions are reproduced in the reference book [ Frenkel M., 1994]. |
86.63 | 100. | ||
124.61 | 150. | ||
167.90 | 200. | ||
237.07 | 273.15 | ||
261.1 ± 3.5 | 298.15 | ||
262.86 | 300. | ||
353.70 | 400. | ||
430.21 | 500. | ||
491.72 | 600. | ||
541.00 | 700. | ||
580.94 | 800. | ||
613.75 | 900. | ||
641.02 | 1000. | ||
663.87 | 1100. | ||
683.17 | 1200. | ||
699.57 | 1300. | ||
713.59 | 1400. | ||
725.63 | 1500. |

References

Dorofeeva O.V., 1989
Dorofeeva O.V.,
Thermodynamic Properties of Gaseous Polycyclic Aromatic Hydrocarbons Containing Five-Membered Rings. Institute for High Temperatures, USSR Academy of Sciences, Preprint No.1-263 (in Russian), Moscow, 1989. [all data]
Dorofeeva O.V., 1986
Dorofeeva O.V.,
On calculation of thermodynamic properties of polycyclic aromatic hydrocarbons,
Thermochim. Acta, 1986, 102, 59-66. [all data]
Moiseeva N.F., 1990
Moiseeva N.F.,
Group additivity scheme for calculating the chemical thermodynamic properties of gaseous polycyclic aromatic hydrocarbons containing five-membered rings,
Thermochim. Acta, 1990, 168, 179-186. [all data]
Frenkel M., 1994
Frenkel M.,
Thermodynamics of Organic Compounds in the Gas State, Vol. I, II, Thermodynamics Research Center, College Station, Texas, 1994, 1994. [all data]