2-Butenenitrile
- Formula: C4H5N
- Molecular weight: 67.0892
- IUPAC Standard InChIKey: NKKMVIVFRUYPLQ-UHFFFAOYSA-N
- CAS Registry Number: 4786-20-3
- Chemical structure:
View 3d structure (requires JavaScript / HTML 5) - Stereoisomers:
- Other names: Crotononitrile; Crotonic nitrile; Crotonitrile; Crotonnitrile; 1-Cyanopropene; 1-Propenyl cyanide; 1-Cyano-1-propylene; Croton acid nitrile; Crotonique nitrile; β-Methylacrylonitrile; NSC 165574; trans or cis-crotononitrile; cis or trans-crotononitrile

Phase change data

Data compiled as indicated in comments:
BS - Robert L. Brown and Stephen E. Stein
Quantity | Value | Units | Method | Reference | Comment |
---|---|---|---|---|---|
Tboil | 393.7 | K | N/A | Weast and Grasselli, 1989 | BS |
Antoine Equation Parameters
log10(P) = A − (B / (T + C))
P = vapor pressure (bar)
T = temperature (K)
View plot Requires a JavaScript / HTML 5 canvas capable browser.
Temperature (K) | A | B | C | Reference | Comment |
---|---|---|---|---|---|
253.7 to 396.0 | 4.40949 | 1586.381 | -35.82 | Stull, 1947 | Coefficents calculated by NIST from author's data. |

Kovats' RI, non-polar column, isothermal

Column type | Active phase | Temperature (C) | I | Reference | Comment |
---|---|---|---|---|---|
Capillary | BPX-5 | 30. | 661. | Aflalaye, Sternberg, et al., 1995 | 12. m/0.15 mm/0.25 μm, H2 |
Capillary | BPX-5 | 30. | 664. | Aflalaye, Sternberg, et al., 1995 | 12. m/0.15 mm/0.25 μm, H2 |
Capillary | CP Sil 5 CB | 20. | 619.8 | Do and Raulin, 1992 | 25. m/0.15 mm/2. μm, H2 |
Capillary | CP Sil 5 CB | 20. | 647.2 | Do and Raulin, 1992 | 25. m/0.15 mm/2. μm, H2 |
Capillary | PoraPLOT Q | 100. | 624. | Do and Raulin, 1989 | 10. m/0.32 mm/10. μm, H2 |
Capillary | PoraPLOT Q | 160. | 624. | Do and Raulin, 1989 | 10. m/0.32 mm/10. μm, H2 |

Normal alkane RI, non-polar column, temperature ramp

Column type | Active phase | I | Reference | Comment |
---|---|---|---|---|
Capillary | ZB-5 | 664. | Vazquez, Demmel, et al., 2011 | 30. m/0.25 mm/0.25 μm, Nitrogen, 40. C @ 5. min, 5. K/min, 200. C @ 5. min |

Normal alkane RI, non-polar column, custom temperature program

Column type | Active phase | I | Reference | Comment |
---|---|---|---|---|
Capillary | ZB-5 | 664. | Vazquez, Demmel, et al., 2011 | 30. m/0.25 mm/0.25 μm, Nitrogen; Program: not specified |
Capillary | DB-5 MS | 697. | Luo and Agnew, 2001 | 30. m/0.25 mm/1.0 μm, Helium; Program: not specified |

Normal alkane RI, polar column, temperature ramp

Column type | Active phase | I | Reference | Comment |
---|---|---|---|---|
Capillary | HP-Innowax | 1162. | Soria, Sanz, et al., 2008 | 50. m/0.20 mm/0.20 μm, Helium, 45. C @ 2. min, 4. K/min, 190. C @ 50. min |

Normal alkane RI, polar column, custom temperature program

Column type | Active phase | I | Reference | Comment |
---|---|---|---|---|
Capillary | Supelcowax 10 | 1162. | Soria, Martinez-Castro, et al., 2008 | 50. m/0.25 mm/0.25 μm, Helium; Program: 45 0C (15 min) 3 0C/min -> 75 0C 5 0C/min -> 180 0C (10 min) |

References

Weast and Grasselli, 1989
CRC Handbook of Data on Organic Compounds, 2nd Editon, Weast,R.C and Grasselli, J.G., ed(s)., CRC Press, Inc., Boca Raton, FL, 1989, 1. [all data]
Stull, 1947
Stull, Daniel R.,
Vapor Pressure of Pure Substances. Organic and Inorganic Compounds,
Ind. Eng. Chem., 1947, 39, 4, 517-540, https://doi.org/10.1021/ie50448a022
. [all data]
Aflalaye, Sternberg, et al., 1995
Aflalaye, A.; Sternberg, R.; Raulin, F.; Vidal-Madjar, C.,
Gas chromatography of Titan's atmosphere. VI. Analysis of low-molecular-mass hydrocarbons and nitriles with BPX5 capillary columns,
J. Chromatogr. A, 1995, 708, 2, 283-291, https://doi.org/10.1016/0021-9673(95)00410-O
. [all data]
Do and Raulin, 1992
Do, L.; Raulin, F.,
Gas chromatography of Titan's atmosphere. III. Analysis of low-molecular-weight hydrocarbons and nitriles with a CP-Sil-5 CB WCOT capillary column,
J. Chromatogr., 1992, 591, 1-2, 297-301, https://doi.org/10.1016/0021-9673(92)80247-R
. [all data]
Do and Raulin, 1989
Do, L.; Raulin, F.,
Gas chromatography of Titan's atmosphere. I. Analysis of low-molecular-weight hydrocarbons and nitriles with a PoraPLOT Q porous polymer coated open-tubular capillary column,
J. Chromatogr., 1989, 481, 45-54, https://doi.org/10.1016/S0021-9673(01)96751-2
. [all data]
Vazquez, Demmel, et al., 2011
Vazquez, A.M.; Demmel, G.I.; Criado, S.G.; Aimar, M.L.; Cantero, J.; Rossi, L.I.; Velasco, M.I.,
Phytochemistry of TAgetes minuta L. (Asteraceae) from Cordoba, Argentina: comparative study between essential oil and HS-SPME analyses,
Boletin Latinoamericano y del Caribe Plantas Medicinales y Aromaticas, 2011, 10, 4, 351-362. [all data]
Luo and Agnew, 2001
Luo, J.; Agnew, M.P.,
Gas characteristics before and after biofiltration treating odorous emissions from animal rendering processes,
Environ. Technol., 2001, 22, 9, 1091-1103, https://doi.org/10.1080/09593332208618220
. [all data]
Soria, Sanz, et al., 2008
Soria, A.C.; Sanz, J.; Martinez-Castro, I.,
SPME followed by GC-MS: a powerful technique for qualitative analysis of honey volatiles,
Eur. Food Res. Technol., 2008, 1-12. [all data]
Soria, Martinez-Castro, et al., 2008
Soria, A.C.; Martinez-Castro, I.; Sanz, J.,
Some aspects of dynamic headspace analysis of volatile components in honey,
Foog Res. International, 2008, 41, 8, 838-848, https://doi.org/10.1016/j.foodres.2008.07.010
. [all data]