Methallyl cyanide
- Formula: C5H7N
- Molecular weight: 81.1158
- IUPAC Standard InChIKey: OIQDAVBXDLGCID-UHFFFAOYSA-N
- CAS Registry Number: 4786-19-0
- Chemical structure:
View 3d structure (requires JavaScript / HTML 5) - Other names: 3-Butenenitrile, 3-methyl-; 3-Methyl-3-butenenitrile; 3-Methyl-3-butenonitrile; Methallylkyanid; 3-Methyl-3-butennitril

Phase change data

Data compiled by: Thermodynamics Research Center, NIST Boulder Laboratories, Chris Muzny director
Quantity | Value | Units | Method | Reference | Comment |
---|---|---|---|---|---|
Tfus | 202.9 | K | N/A | Anonymous, 1955 | Uncertainty assigned by TRC = 0.6 K |

References

Anonymous, 1955
Anonymous, R.,
, Am. Pet. Inst. Res. Proj. 45, Tech. Rep. 14, No. 1, Ohio State Univ., 1955. [all data]