2-Butene, 1-bromo-
- Formula: C4H7Br
- Molecular weight: 135.002
- IUPAC Standard InChIKey: AVMHMVJVHYGDOO-NSCUHMNNSA-N
- CAS Registry Number: 4784-77-4
- Chemical structure:
View 3d structure (requires JavaScript / HTML 5) - Species with the same structure:
- Other names: Crotyl bromide; 1-Bromo-2-butene; Crotonyl bromide; 1-Crotyl bromide; 2-Butenyl bromide; 1-bromobut-2-ene

Phase change data

Data compiled as indicated in comments:
BS - Robert L. Brown and Stephen E. Stein
TRC - Thermodynamics Research Center, NIST Boulder Laboratories, Chris Muzny director
Quantity | Value | Units | Method | Reference | Comment |
---|---|---|---|---|---|
Tboil | 376. to 379. | K | N/A | Buckingham and Donaghy, 1982 | BS |
Tboil | 371.15 | K | N/A | Petrov, Chel'tsova, et al., 1952 | Uncertainty assigned by TRC = 2. K; TRC |
Reduced pressure boiling point
Tboil (K) | Pressure (bar) | Reference | Comment |
---|---|---|---|
286. | 0.013 | Buckingham and Donaghy, 1982 | BS |

Reaction thermochemistry data

Data compiled by: Hussein Y. Afeefy, Joel F. Liebman, and Stephen E. Stein
Individual Reactions
By formula: C4H7Br = C4H7Br
Quantity | Value | Units | Method | Reference | Comment |
---|---|---|---|---|---|
ΔrH° | -4.0 ± 0.54 | kJ/mol | Eqk | Shishinova, Levanova, et al., 1978 | gas phase; UV Irradiation |
ΔrH° | -4.0 ± 0.54 | kJ/mol | Eqk | Shishinova, Levanova, et al., 1977 | gas phase |

References

Buckingham and Donaghy, 1982
Buckingham, J.; Donaghy, S.M.,
Dictionary of Organic Compounds: Fifth Edition, Chapman and Hall, New York, 1982, 1. [all data]
Petrov, Chel'tsova, et al., 1952
Petrov, A.D.; Chel'tsova, M.A.; Chernyshev, E.A.,
Behaviour of γ-Alkenyl Halides in the Grignard-Wurtz Synthesis,
Izv. Akad. Nauk SSSR, 1952, 1952, 1087. [all data]
Shishinova, Levanova, et al., 1978
Shishinova, V.I.; Levanova, S.V.; Shevtsova, L.A.; Rozhnov, A.M.; Kudryavtsev, V.A.,
Thermodynamic functions of bromobutenes,
Russ. J. Phys. Chem. (Engl. Transl.), 1978, 52, 270-271. [all data]
Shishinova, Levanova, et al., 1977
Shishinova, V.I.; Levanova, S.V.; Shevtsova, L.A.; Rozhnov, A.M.; Kudryavtsev, V.A.,
Thermodynamic functions of bromobutenes,
Deposited Doc., 1977, 1-6. [all data]