3-Cyclohexene-1-carboxylic acid
- Formula: C7H10O2
- Molecular weight: 126.1531
- IUPAC Standard InChIKey: VUSWCWPCANWBFG-UHFFFAOYSA-N
- CAS Registry Number: 4771-80-6
- Chemical structure:
View 3d structure (requires JavaScript / HTML 5) - Other names: δ3-Cyclohexenecarboxylic acid; δ3-Cyclohexenylcarboxylic acid; 1-Cyclohexene-4-carboxylic acid; 3-Cyclohexenecarboxylic acid; 1,2,3,6-Tetrahydrobenzoic acid; Kyselina 1,2,5,6-tetrahydrobenzoova; NSC 44712; NSC 44883; cyclohex-3-ene-1-carboxylic acid

Phase change data

Data compiled by: Robert L. Brown and Stephen E. Stein
Reduced pressure boiling point
Tboil (K) | Pressure (bar) | Reference |
---|---|---|
401. to 404. | 0.024 | Frinton Laboratories Inc., 1986 |

Normal alkane RI, polar column, custom temperature program

Column type | Active phase | I | Reference | Comment |
---|---|---|---|---|
Capillary | BP-20 | 1360. | Rodrigues, Caldera, et al., 2008 | 30. m/0.25 mm/0.25 μm, Helium; Program: 40 0C (1 min) 2 0C/min -> 100 0C (2 min) 1.7 0C/min -> 180 0C (1 min) 25 0C/min -> 220 0C (10 min) |

References

Frinton Laboratories Inc., 1986
Frinton Laboratories Inc.,
Catalog Number 11, Frinton Laboratories Inc., Vineland, NJ, 1986, 99. [all data]
Rodrigues, Caldera, et al., 2008
Rodrigues, F.; Caldera, M.; Camara, J.S.,
development of a dynamic headspace solid-phase microextraction procedure coupled to GC-qMSD for evaluation the chemical profile in alcoholic beverages,
Anal. Chim. Acta, 2008, 609, 1, 82-104, https://doi.org/10.1016/j.aca.2007.12.041
. [all data]