benzene-1,2,3,4-tetracarboxylic acid
- Formula: C10H6O8
- Molecular weight: 254.1498
- CAS Registry Number: 476-73-3

Condensed phase thermochemistry data

Data compiled by: Hussein Y. Afeefy, Joel F. Liebman, and Stephen E. Stein
Quantity | Value | Units | Method | Reference | Comment |
---|---|---|---|---|---|
ΔfH°solid | -1548.6 ± 0.84 | kJ/mol | Ccb | Yukhno and Bikkulov, 1971 | |
Quantity | Value | Units | Method | Reference | Comment |
ΔcH°solid | -3244.0 ± 0.84 | kJ/mol | Ccb | Yukhno and Bikkulov, 1971 | Corresponding ΔfHºsolid = -1548.6 kJ/mol (simple calculation by NIST; no Washburn corrections) |

Phase change data

Data compiled by: Thermodynamics Research Center, NIST Boulder Laboratories, Chris Muzny director
Quantity | Value | Units | Method | Reference | Comment |
---|---|---|---|---|---|
Tfus | 510.15 | K | N/A | Smith and Carlson, 1939 | Uncertainty assigned by TRC = 2. K |
Tfus | 509.15 | K | N/A | Smith and Kiess, 1939 | Uncertainty assigned by TRC = 1.5 K |

References

Yukhno and Bikkulov, 1971
Yukhno, G.F.; Bikkulov, A.Z.,
Enthalpies of combustion and formation of benzenecarboxylic acids,
Russ. J. Phys. Chem. (Engl. Transl.), 1971, 45, 924-925. [all data]
Smith and Carlson, 1939
Smith, L.I.; Carlson, E.J.,
Prehnitic Acid (Benzene-1,2,3,4-tetracroxylic Acid),
J. Am. Chem. Soc., 1939, 61, 288. [all data]
Smith and Kiess, 1939
Smith, L.I.; Kiess, M.A.,
Polymethylbenzenes. XXIII. The Preparation and Physical Propeties of 3- and 5-Ethylpseudocumenes and of Ethylmesitylene,
J. Am. Chem. Soc., 1939, 61, 284. [all data]