Silicic acid (H4SiO4), tetrabutyl ester
- Formula: C16H36O4Si
- Molecular weight: 320.5401
- IUPAC Standard InChIKey: UQMOLLPKNHFRAC-UHFFFAOYSA-N
- CAS Registry Number: 4766-57-8
- Chemical structure:

Condensed phase thermochemistry data

Data compiled by: Eugene S. Domalski and Elizabeth D. Hearing
Constant pressure heat capacity of liquid
Cp,liquid (J/mol*K) | Temperature (K) | Reference |
---|---|---|
580.2 | 298.15 | Nkinamubanzi, Charlet, et al., 1985 |

Phase change data

Data compiled as indicated in comments:
BS - Robert L. Brown and Stephen E. Stein
AC - William E. Acree, Jr., James S. Chickos
Quantity | Value | Units | Method | Reference | Comment |
---|---|---|---|---|---|
ΔvapH° | 52.0 ± 1.0 | kJ/mol | C | Voronkov, Baryshok, et al., 1988 | AC |
Reduced pressure boiling point
Tboil (K) | Pressure (bar) | Reference | Comment |
---|---|---|---|
393. | 0.004 | PCR Inc., 1990 | BS |
Enthalpy of vaporization
ΔvapH (kJ/mol) | Temperature (K) | Method | Reference | Comment |
---|---|---|---|---|
79.6 | 348. | A | Stephenson and Malanowski, 1987 | Based on data from 333. to 479. K.; AC |

Kovats' RI, non-polar column, isothermal

Column type | Active phase | Temperature (C) | I | Reference | Comment |
---|---|---|---|---|---|
Packed | Apiezon L | 100. | 1490. | Kreshkov, Kirichenko, et al., 1975 | Ar; Column length: 1. m |
Packed | Apiezon L | 150. | 1480. | Kreshkov, Kirichenko, et al., 1975 | Ar; Column length: 1. m |
Capillary | Apiezon L | 160. | 1483.2 | Peetre, 1974 | Column length: 50. m; Column diameter: 0.25 mm |
Packed | Apiezon L | 160. | 1488. | Peetre, 1974, 2 | Column length: 3. m |

Normal alkane RI, non-polar column, isothermal

Column type | Active phase | Temperature (C) | I | Reference | Comment |
---|---|---|---|---|---|
Packed | Apieson M | 160. | 1488. | Ellren, Peetre, et al., 1974 | Chromosorb G AW DMCS (80-100 mesh) |

References

Nkinamubanzi, Charlet, et al., 1985
Nkinamubanzi, P.; Charlet, G.; Delmas, G.,
Excess enthalpies, excess heat capacities and excess volumes of tetraalkoxysilanes with cyclohexane and carbon tetrachloride,
Fluid Phase Equilibria, 1985, 20, 57-73. [all data]
Voronkov, Baryshok, et al., 1988
Voronkov, M.G.; Baryshok, V.P.; Klyuchnikov, V.A.; Danilova, T.F.; Pepekin, V.I.; Korchagina, A.N.; Khudobin, Yu.I.,
Thermochemistry of organosilicon compounds,
Journal of Organometallic Chemistry, 1988, 345, 1-2, 27-38, https://doi.org/10.1016/0022-328X(88)80231-6
. [all data]
PCR Inc., 1990
PCR Inc.,
Research Chemicals Catalog 1990-1991, PCR Inc., Gainesville, FL, 1990, 1. [all data]
Stephenson and Malanowski, 1987
Stephenson, Richard M.; Malanowski, Stanislaw,
Handbook of the Thermodynamics of Organic Compounds, 1987, https://doi.org/10.1007/978-94-009-3173-2
. [all data]
Kreshkov, Kirichenko, et al., 1975
Kreshkov, A.P.; Kirichenko, É.A.; Markov, B.A.,
Retention indices of alkoxychlorosilanes,
Zh. Anal. Khim., 1975, 30, 2, 286-289. [all data]
Peetre, 1974
Peetre, I.-B.,
Gas chromatographic investigation of organometallic compounds and their carbon analogues. II. Improved method for calculating retention indices of tetraalkoxysilanes,
J. Chromatogr., 1974, 88, 2, 311-321, https://doi.org/10.1016/S0021-9673(00)83155-6
. [all data]
Peetre, 1974, 2
Peetre, I.-B.,
Gas chromatographic investigation of organometallic compounds and their carbon analogues. III. A study of Kováts retention indices for tetraalkoxysilanes containing branched alkoxy groups,
J. Chromatogr., 1974, 90, 1, 35-40, https://doi.org/10.1016/S0021-9673(01)94771-5
. [all data]
Ellren, Peetre, et al., 1974
Ellren, O.; Peetre, I.B.; Smith, B.E.F.,
Gas chromatographic investigation of organometallic compounds and their carbon analogues. V. Use of refractive index in conjunction with Kovats retention index for the identification of organosilicon compounds,
J. Chromatogr., 1974, 93, 2, 383-392, https://doi.org/10.1016/S0021-9673(01)85402-9
. [all data]